Peptide,PTM,ModifiedAA,ModifiedPosition,PeptideUniqueToGene,ExperimentDesc,ExpID,PubmedID,ScoreType,IdentScore,LocProb,Log2FChange,PQ-val,QuantSig,PEP,MassErrorPPM
MKKAFGQTVR,nta,M,1,true,"Arabidopsis translation initiation landscape - NTA",167a,35069635,,,,,,,,
YHNSMHRPSGGYGDK,ph,S,168,true,"TOR Kinase and ABA Receptor",100,29290610,XCorr,3.1850131,0.8744000,,,,0.00077270000474527,
PSGGYGDKYDYEGR,ub,K,174,true,"Arabidopsis ubiquitination COFRADIC",40,26744219,"MaxQuant Score",65.2190000,1.0000000,,,,0.00013770000077784,-0.5460000
YGDRDEGRSSYGK,ph,S,190,true,"Tissue atlas Arabidopsis - ProteomicsDB",114,32188942,"MaxQuant score",74.9930000,0.7621700,,,,0.00051272101700306,
EYGYRDDDRNSR,ph,S,206,false,"Tissue atlas Arabidopsis - ProteomicsDB",114,32188942,"MaxQuant score",106.4200000,1.0000000,,,,2.7820200557471E-5,
YSRDSEDRYGR,ph,S,216,true,"Tissue atlas Arabidopsis - ProteomicsDB",114,32188942,"MaxQuant score",72.6150000,0.9990880,,,,0.00076564302435145,
DGNTDDEYRGR,ph,T,226,true,"atm and atr DNA damage response",88,25561503,"MASCOT Score",21.0000000,1.0000000,,,,,-0.6000000
SRSVDNYNGSR,ph,S,234,true,"Tissue atlas Arabidopsis - ProteomicsDB",114,32188942,"MaxQuant score",77.1920000,0.8361520,,,,0.00043096300214529,
SRSVDNYNGSR,ph,S,236,true,"atm and atr DNA damage response",88,25561503,"MASCOT Score",54.0000000,1.0000000,,,,,-0.3600000
SVDNYNGSR,ph,S,236,true,"atm and atr DNA damage response",88,25561503,"MASCOT Score",36.0000000,1.0000000,,,,,-0.0500000
SVDNYNGSR,ph,S,236,true,"Tissue atlas Arabidopsis - ProteomicsDB",114,32188942,"MaxQuant score",111.8300000,1.0000000,,,,6.0283800848993E-5,
SVDNYNGSR,ph,S,243,true,"atm and atr DNA damage response",88,25561503,"MASCOT Score",43.0000000,1.0000000,,,,,0.2500000
SVDNYNGSR,ph,S,243,true,"Tissue atlas Arabidopsis - ProteomicsDB",114,32188942,"MaxQuant score",72.8170000,0.9999650,,,,0.0073285098187625,
ERPIEDDGQSSSR,ph,S,260,true,"atm and atr DNA damage response",88,25561503,"MASCOT Score",50.0000000,0.9970000,,,,,0.2300000
ERPIEDDGQSSSR,ph,S,260,true,"Tissue atlas Arabidopsis - ProteomicsDB",114,32188942,"MaxQuant score",103.8800000,0.9497310,,,,0.00034406699705869,
ERPIEDDGQSSSRDSGAPADDHSQDGR,ph,S,261,true,"Tissue atlas Arabidopsis - ProteomicsDB",114,32188942,"MaxQuant score",162.4600000,0.8757320,,,,4.500139982877E-10,
ERPIEDDGQSSSR,ph,S,262,true,"Tissue atlas Arabidopsis - ProteomicsDB",114,32188942,"MaxQuant score",45.6110000,0.9051480,,,,0.0008277419838123,
ERPIEDDGQSSSRDSGAPADDHSQDGR,ph,S,265,true,"Tissue atlas Arabidopsis - ProteomicsDB",114,32188942,"MaxQuant score",134.1900000,0.9504140,,,,1.1224400699242E-42,
DSGAPADDHSQDGRGGLER,ph,S,273,true,"TOR Kinase and ABA Receptor",100,29290610,XCorr,2.3331392,1.0000000,,,,0.0084969997406006,
DSGAPADDHSQDGR,ph,S,273,true,"atm and atr DNA damage response",88,25561503,"MASCOT Score",76.0000000,1.0000000,,,,,0.0000000
DSGAPADDHSQDGR,ph,S,273,true,"Tissue atlas Arabidopsis - ProteomicsDB",114,32188942,"MaxQuant score",234.3600000,1.0000000,,,,0,
KFSEQNIGAAPPSYEEAVSESRSPVYSER,ph,S,285,true,"TOR Kinase and ABA Receptor",100,29290610,XCorr,4.0790715,0.9983000,,,,0.025070000439882,
KFSEQNIGAAPPSYEEAVSESRSPVYSER,ph,S,285,true,"Tissue atlas Arabidopsis - ProteomicsDB",114,32188942,"MaxQuant score",304.3500000,1.0000000,,,,0,
KFSEQNIGAAPPSYEEAVSESR,ph,S,285,true,"STN8 phosphoproteome",38,21768351,"MASCOT Score",96.7300000,,,,,,-1.1072600
KFSEQNIGAAPPSYEEAVSESR,ph,S,285,true,"Phosphoproteome iron-deficient Arabidopsis roots",41,22438062,"MASCOT Score",61.4000000,,,,,,
KFSEQNIGAAPPSYEEAVSESR,ph,S,285,true,"PAMP-triggered phosphorylation",48,24601666,"MASCOT Score",48.3900000,,,,,,
KFSEQNIGAAPPSYEEAVSESR,ph,S,285,true,"Conserved plant phosphoproteome - Arabidopsis",61a,20466843,"MASCOT Score",64.0000000,1.0000000,,,,,
KFSEQNIGAAPPSYEEAVSESR,ph,S,285,true,"srk2dei ABA signaling phopshoproteomics",83,23572148,"MASCOT Score",76.0000000,,,,,,-0.0004000
KFSEQNIGAAPPSYEEAVSESR,ph,S,285,true,"LAXIC - mannitol vs control",84b,23660473,XCorr,2.9100000,1.0000000,,,,1.2300000129528E-8,
KFSEQNIGAAPPSYEEAVSESR,ph,S,285,true,"SnRK2 protein kinase substrates",85,23776212,XCorr,2.4905014,1.0000000,,,,0.0035486801061779,
KFSEQNIGAAPPSYEEAVSESR,ph,S,285,true,"TOR Kinase and ABA Receptor",100,29290610,XCorr,3.9969206,1.0000000,,,,0.00011629999789875,
KFSEQNIGAAPPSYEEAVSESR,ph,S,285,true,"Phospho cell culture sucrose/TOR",109,30833711,,,1.0000000,,,,,
KFSEQNIGAAPPSYEEAVSESR,ph,S,285,true,"Col-0 callus - FC Col-0 vs. Col-0 Xray",111a,31410901,,37.9800000,,0.7876113,0.0000000,NO,,1.1932888
KFSEQNIGAAPPSYEEAVSESR,ph,S,285,true,"Col-0 X-ray callus - FC Col-0 vs. Col-0 Xray",111b,31410901,,37.9800000,,0.7876113,0.0000000,NO,,1.1932888
KFSEQNIGAAPPSYEEAVSESR,ph,S,285,true,"atm callus - FC atm vs. atm Xray",111c,31410901,,37.9800000,,0.6724004,0.0000000,NO,,1.1932888
KFSEQNIGAAPPSYEEAVSESR,ph,S,285,true,"atm-3 X-ray callus - FC atm vs. atm Xray",111d,31410901,,37.9800000,,0.6724004,0.0000000,NO,,1.1932888
SPVYSER,ph,S,305,false,"Phospho cell culture sucrose/TOR",109,30833711,,,0.9999970,,,,,
SPVYSER,ph,S,305,false,"Tissue atlas Arabidopsis - ProteomicsDB",114,32188942,"MaxQuant score",247.0900000,1.0000000,,,,0,
FSEQNIGAAPPSYEEAVSESRSPVYSER,ph,Y,308,true,"TOR Kinase and ABA Receptor",100,29290610,XCorr,3.9521694,0.8133000,,,,3.7130000691832E-6,
SPVYSER,ph,S,309,false,"Tissue atlas Arabidopsis - ProteomicsDB",114,32188942,"MaxQuant score",100.7300000,0.9999510,,,,8.3007301839367E-23,
DGGETPQVAPPGAAASPLAENISVDNK,ph,T,316,true,"Pollen phosphoproteome Arabidopsis",43,22631563,"MASCOT Score",120.5900000,,,,,,-2.3337200
DGGETPQVAPPGAAASPLAENISVDNK,ph,T,316,true,"Tissue atlas Arabidopsis - ProteomicsDB",114,32188942,"MaxQuant score",124.1900000,1.0000000,,,,1.039319988353E-34,
DGGETPQVAPPGAAASPLAENISVDNK,ph,S,327,true,"Pollen phosphoproteome Arabidopsis",43,22631563,"MASCOT Score",120.5900000,,,,,,-2.3337200
AADFVNESSPQQVEAFDEFDPR,ph,S,347,true,"Tissue atlas Arabidopsis - ProteomicsDB",114,32188942,"MaxQuant score",271.0500000,0.9999290,,,,0,
STIWADTLSR,og,S,827,true,"O-GlcNac Inflorescence Tissue",81,28154133,"MASCOT Score",29.0000000,,,,,,0.8000000
STIWADTLSR,ph,S,827,true,"Tissue atlas Arabidopsis - ProteomicsDB",114,32188942,"MaxQuant score",109.3900000,0.7728880,,,,0.00022290600463748,
GLVNFNISGPK,ph,S,844,true,"Tissue atlas Arabidopsis - ProteomicsDB",114,32188942,"MaxQuant score",165.3500000,1.0000000,,,,3.1657499538484E-11,
RLEKPTITQQQVTSTINMGK,og,T,874,true,"O-GlcNac Inflorescence Tissue",81,28154133,"MASCOT Score",59.2000000,,,,,,-0.4000000
AMGSGTGLGR,ph,S,890,false,"Tissue atlas Arabidopsis - ProteomicsDB",114,32188942,"MaxQuant score",57.8850000,0.9413720,,,,0.017697099596262,
