Peptide,PTM,ModifiedAA,ModifiedPosition,PeptideUniqueToGene,ExperimentDesc,ExpID,PubmedID,ScoreType,IdentScore,LocProb,Log2FChange,PQ-val,QuantSig,PEP,MassErrorPPM
VGFQNHNENLSITNADK,ph,S,90,true,"Tissue atlas Arabidopsis - ProteomicsDB",114,32188942,"MaxQuant score",224.9900000,0.9999560,,,,0,
VGFQNHNENLSITNADKSSDRNSGK,ph,S,97,true,"Plasmamembrane phosphorylation",20,15308754,,,,,,,,
VGFQNHNENLSITNADKSSDRNSGK,ph,S,102,true,"Plasmamembrane phosphorylation",20,15308754,,,,,,,,
SSDNDSISQCSSVHHHER,ph,S,114,true,"Tissue atlas Arabidopsis - ProteomicsDB",114,32188942,"MaxQuant score",90.8210000,0.8234100,,,,7.2179301469077E-7,
ACSSHSGEDGSFGAAWR,ph,S,137,true,"Tissue atlas Arabidopsis - ProteomicsDB",114,32188942,"MaxQuant score",168.6400000,0.9997590,,,,4.5761000696529E-22,
FAAENVIGEGGYGVVYKGR,ub,K,206,true,"Ubiquitination Membrane Proteins",120,33585938,,,,,,,,
FAAENVIGEGGYGVVYKGR,ub,K,206,true,"upl3 mutant / wildtype",168,35926874,"MaxQuant score",82.8650000,1.0000000,1.5210507,0.0263420,YES,5.0281500989513E-6,0.0411010
LLDSGESHITTR,ph,S,346,false,"Tissue atlas Arabidopsis - ProteomicsDB",114,32188942,"MaxQuant score",80.4740000,0.9754460,,,,0.0078554200008512,
LLDSGESHITTR,ph,T,349,false,"Tissue atlas Arabidopsis - ProteomicsDB",114,32188942,"MaxQuant score",174.4400000,0.9972940,,,,1.2210899812451E-14,
LLDSGESHITTR,ph,T,350,false,"atm and atr DNA damage response",88,25561503,"MASCOT Score",52.0000000,0.8490000,,,,,0.1800000
LLDSGESHITTR,ph,T,350,false,"TOR Kinase and ABA Receptor",100,29290610,XCorr,3.9916241,0.9243000,,,,0.0053130001761019,
LLDSGESHITTR,ph,T,350,false,"Tissue atlas Arabidopsis - ProteomicsDB",114,32188942,"MaxQuant score",199.8400000,0.9995380,,,,4.221499993008E-24,
MMVGTRR,ph,T,413,false,"Tyrosine phosphorylation in Arabidopsis",59,18463617,"MASCOT Score",20.0000000,,,,,,1.8722905
TASMEIVETTEESADTSKGPGHSENTTKPEK,ph,S,481,true,"Tissue atlas Arabidopsis - ProteomicsDB",114,32188942,"MaxQuant score",198.5100000,0.9955720,,,,0,
