Peptide,PTM,ModifiedAA,ModifiedPosition,PeptideUniqueToGene,ExperimentDesc,ExpID,PubmedID,ScoreType,IdentScore,LocProb,Log2FChange,PQ-val,QuantSig,PEP,MassErrorPPM
YQVPVSEHGTVK,ph,S,67,false,"Tissue atlas Arabidopsis - ProteomicsDB",114,32188942,"MaxQuant score",65.3290000,0.7668930,,,,0.0077777500264347,
YQVPVSEHGTVK,ph,T,71,false,"Tissue atlas Arabidopsis - ProteomicsDB",114,32188942,"MaxQuant score",93.6490000,0.9933780,,,,0.00065510498825461,
SSISYIDGDEGILR,nt,S,104,false,"Arabidopsis translation initiation landscape - NT",167b,35069635,,,,,,,,
YIDGDEGILR,nt,Y,108,false,"Arg/N-end rule seed, prt6 vs. Wt",99,29168982,"MASCOT Score",45.2600000,,-0.6214455,0.0003451,NO,0.010499999858439,-1.5920167
AEHEMNCSTAAAR,nt,A,284,false,"Arg/N-end rule seed, prt6 vs. Wt",99,29168982,"MASCOT Score",40.8400000,,,,,0.027629999443889,-0.6700421
AALSDEYFVKR,ac,K,408,false,"Quantitative Acetylproteomics",101,29440448,,,,,,,,
LYPNVDFYSGLINR,ph,Y,412,true,"BSK8 and BSL2 regulating sucrose-ph synthase",66,24924143,"MaxQuant Score",50.6530000,,,,,,-3.0742000
LYPNVDFYSGLINR,ph,Y,418,true,"BSK8 and BSL2 regulating sucrose-ph synthase",66,24924143,"MaxQuant Score",50.6530000,,,,,,-3.0742000
LYPNVDFYSGLINR,ph,S,419,true,"BSK8 and BSL2 regulating sucrose-ph synthase",66,24924143,"MaxQuant Score",50.6530000,,,,,,-3.0742000
