Peptide,PTM,ModifiedAA,ModifiedPosition,PeptideUniqueToGene,ExperimentDesc,ExpID,PubmedID,ScoreType,IdentScore,LocProb,Log2FChange,PQ-val,QuantSig,PEP,MassErrorPPM
TSSFALTEVK,ph,S,67,true,"atm and atr DNA damage response",88,25561503,"MASCOT Score",60.0000000,0.9560000,,,,,-1.5000000
TSSFALTEVK,ph,S,67,true,"TOR Kinase and ABA Receptor",100,29290610,XCorr,2.8524945,0.9871000,,,,0.00072259997250512,
TSSFALTEVK,ph,S,67,true,"Tissue atlas Arabidopsis - ProteomicsDB",114,32188942,"MaxQuant score",117.0900000,0.9997600,,,,0.00017413700697944,
LPKFDHFSEGETK,ac,K,110,true,"Quantitative Acetylproteomics",101,29440448,,,,,,,,
FDHFSEGETKNDLTGLAR,ac,K,120,true,"Quantitative Acetylproteomics",101,29440448,,,,,,,,
SLQTSFLTLDE,nt,S,152,true,"Arg/N-end rule seed, prt6 vs. Wt",99,29168982,"MASCOT Score",53.0900000,,-0.7493114,0.2476018,NO,3.3330001315335E-5,0.9289930
LENTISYIK,ph,S,187,true,"atm and atr DNA damage response",88,25561503,"MASCOT Score",52.0000000,0.9540000,,,,,-0.4700000
LENTISYIK,ph,S,187,true,"Tissue atlas Arabidopsis - ProteomicsDB",114,32188942,"MaxQuant score",150.0900000,0.9978070,,,,0.00016625100397505,
QAANAKEFAEEMVLEDISMQR,nt,Q,218,true,"HUNTER N-terminome: legumain, GluC and trypsin",119,31951383,"MaxQuant score",45.3470000,,,,,,
GISINAAR,ph,S,241,true,"Arabidopsis root NAA phosphoproteome",18a,27643528,"MaxQuant Score",51.2760000,1.0000000,,,,0.0020000000949949,-0.7790000
GISINAAR,ph,S,241,true,"Ethylene-regulated phosphorylation ein2 mutant",30,19253305,"MASCOT Score",46.6667000,,,,,,12.5478790
GISINAAR,ph,S,241,true,"STN8 phosphoproteome",38,21768351,"MASCOT Score",64.9100000,,,,,,-0.5047220
GISINAAR,ph,S,241,true,"Pollen phosphoproteome Arabidopsis",43,22631563,"MASCOT Score",64.6100000,,,,,,-0.9126860
GISINAAR,ph,S,241,true,"Tyrosine phosphorylation in Arabidopsis",59,18463617,"MASCOT Score",54.0000000,,,,,,-0.6814960
GISINAAR,ph,S,241,true,"Chloroplast kinase substrates",60,19376835,"MASCOT Score",55.7300000,,,,,,-0.1420870
GISINAAR,ph,S,241,true,"srk2dei ABA signaling phopshoproteomics",83,23572148,"MASCOT Score",52.0000000,,,,,,-0.0002000
GISINAAR,ph,S,241,true,"LAXIC - ABA stress",84a,23660473,XCorr,2.8800000,1.0000000,,,,0.147425994277,
GISINAAR,ph,S,241,true,"LAXIC - mannitol vs control",84b,23660473,XCorr,2.7500000,1.0000000,,,,0.0091026397421956,
GISINAAR,ph,S,241,true,"SnRK2 protein kinase substrates",85,23776212,XCorr,2.7620211,1.0000000,,,,0.0031947400420904,
GISINAAR,ph,S,241,true,"SIRK1 phosphorylation",86a,23820729,"MaxQuant Score",130.7100000,1.0000000,,,,0.037999998778105,7.5820000
GISINAAR,ph,S,241,true,"SIRK1 exp - sirk1 mutant vs WT",86b,23820729,,,,-0.7525079,,NO,,
GISINAAR,ph,S,241,true,"SIRK1 exp - 35S:SIRK1 vs WT",86c,23820729,,,,0.7315789,,NO,,
GISINAAR,ph,S,241,true,"atm and atr DNA damage response",88,25561503,"MASCOT Score",59.0000000,1.0000000,,,,,0.0100000
GISINAAR,ph,S,241,true,"Protein sumoylation and phosphorylation cross-talk",97,28419593,,,,,,,,
GISINAAR,ph,S,241,true,"TOR Kinase and ABA Receptor",100,29290610,XCorr,3.0301599,1.0000000,,,,0.011710000224411,
GISINAAR,ph,S,241,true,"Lateral root-induction - NAA vs control",106,23328941,"MASCOT Score",29.0000000,,,,,,
GISINAAR,ph,S,241,true,"Phospho cell culture sucrose/TOR",109,30833711,,,1.0000000,,,,,
GISINAAR,ph,S,241,true,"Tissue atlas Arabidopsis - ProteomicsDB",114,32188942,"MaxQuant score",174.4800000,1.0000000,,,,0.00022882099437993,
