Peptide,PTM,ModifiedAA,ModifiedPosition,PeptideUniqueToGene,ExperimentDesc,ExpID,PubmedID,ScoreType,IdentScore,LocProb,Log2FChange,PQ-val,QuantSig,PEP,MassErrorPPM
RHSLEPSITSK,ph,S,8,true,"atm and atr DNA damage response",88,25561503,"MASCOT Score",53.0000000,0.9910000,,,,,-0.5700000
RHSLEPSITSK,ph,S,8,true,"TOR Kinase and ABA Receptor",100,29290610,XCorr,3.6322434,1.0000000,,,,0.00015930000517983,
RHSLEPSITSK,ph,S,8,true,"Phospho cell culture sucrose/TOR",109,30833711,,,0.9999960,,,,,
RHSLEPSITSK,ph,S,8,true,"Tissue atlas Arabidopsis - ProteomicsDB",114,32188942,"MaxQuant score",142.0300000,0.9999990,,,,1.1693899892862E-7,
HSLEPSITSK,ph,T,14,true,"Tissue atlas Arabidopsis - ProteomicsDB",114,32188942,"MaxQuant score",167.8300000,0.9983240,,,,6.4073100247697E-7,
FRDSLSFQRDDDVINKPDFR,ph,S,22,true,"TOR Kinase and ABA Receptor",100,29290610,XCorr,2.0399282,0.8718000,,,,0.022099999710917,
FRDSLSFQR,ph,S,22,true,"atm and atr DNA damage response",88,25561503,"MASCOT Score",32.0000000,0.9440000,,,,,-0.6100000
DSLSFQR,ph,S,22,true,"Tissue atlas Arabidopsis - ProteomicsDB",114,32188942,"MaxQuant score",102.5100000,0.9999860,,,,0.00013030999980401,
DDDVINKPDFR,ub,K,32,true,"Arabidopsis ubiquitination COFRADIC",40,26744219,"MaxQuant Score",53.2370000,1.0000000,,,,0.0089999996125698,0.9440000
ELDFGSPLRPR,ph,S,42,true,"atm and atr DNA damage response",88,25561503,"MASCOT Score",27.0000000,1.0000000,,,,,-0.5200000
ELDFGSPLRPR,ph,S,42,true,"Tissue atlas Arabidopsis - ProteomicsDB",114,32188942,"MaxQuant score",195.7700000,1.0000000,,,,3.0190100920861E-18,
SHSGELSGLSQTSPVKPGSVNR,ph,S,85,true,"atm and atr DNA damage response",88,25561503,"MASCOT Score",36.0000000,0.9880000,,,,,0.9500000
SHSGELSGLSQTSPVKPGSVNR,ph,S,85,true,"Phospho cell culture sucrose/TOR",109,30833711,,,0.9957850,,,,,
SHSGELSGLSQTSPVKPGSVNR,ph,S,85,true,"Tissue atlas Arabidopsis - ProteomicsDB",114,32188942,"MaxQuant score",159.2200000,0.9998030,,,,5.430680070188E-38,
RSHSGELSGLSQTSPVKPGSVNR,ph,S,89,true,"Large-scale phosphorylation discovery",44,23111157,XCorr,5.3360000,,,,,,
SHSGELSGLSQTSPVKPGSVNR,ph,S,89,true,"atm and atr DNA damage response",88,25561503,"MASCOT Score",21.0000000,0.9750000,,,,,0.8700000
SHSGELSGLSQTSPVKPGSVNR,ph,S,95,true,"LAXIC - mannitol vs control",84b,23660473,XCorr,4.1300000,0.8320000,1.0420175,,NO,0.0004140030068811,
SHSGELSGLSQTSPVKPGSVNR,ph,S,95,true,"Tissue atlas Arabidopsis - ProteomicsDB",114,32188942,"MaxQuant score",160.5100000,0.9654470,,,,1.9286400069642E-38,
RSASAGTPLIYSGLGFSPVNNNNNSSR,ph,S,113,true,"TOR Kinase and ABA Receptor",100,29290610,XCorr,6.3050408,0.9401000,,,,1.7679999686493E-8,
GGGSGATSPNPGVLPTGNICPSGR,ph,S,142,true,"Tissue atlas Arabidopsis - ProteomicsDB",114,32188942,"MaxQuant score",202.4600000,0.9989360,,,,0,
GGGSGATSPNPGVLPTGNICPSGR,ph,T,145,true,"Tissue atlas Arabidopsis - ProteomicsDB",114,32188942,"MaxQuant score",193.8700000,0.9366450,,,,0,
GGGSGATSPNPGVLPTGNICPSGR,ph,S,146,true,"Tissue atlas Arabidopsis - ProteomicsDB",114,32188942,"MaxQuant score",208.6300000,0.9970200,,,,0,
GGGSGATSPNPGVLPTGNICPSGR,sno,C,158,true,"hot5-4 / wildtype, FAT-switch S-nitrosoproteome",169,37277371,,,,,,,,
AACWFK,ox,C,492,false,"OxiTRAQ Arabidopsis - 5 mM H2O2 versus control",47,24376095,,,,0.1976194,0.0840146,NO,,
NALSNKSEEPK,ph,S,568,true,"Tissue atlas Arabidopsis - ProteomicsDB",114,32188942,"MaxQuant score",78.6920000,0.9974940,,,,0.0026911699678749,
