Peptide,PTM,ModifiedAA,ModifiedPosition,PeptideUniqueToGene,ExperimentDesc,ExpID,PubmedID,ScoreType,IdentScore,LocProb,Log2FChange,PQ-val,QuantSig,PEP,MassErrorPPM
TVAGNGATGSSLAAR,nt,T,53,true,"FtsH12 N-terminome: WT / FtsH12 knockdown miRNA",118,33216923,"MaxQuant score",146.3600000,,-1.1655211,0.0044085,YES,1.5999999719227E-13,
TVAGNGATGSSLAAR,nta,T,53,true,"Characterization plant N-terminal acetylation",6,22223895,"MASCOT Score",129.5800000,,,,,,
TVAGNGATGSSLAAR,nta,T,53,true,"FtsH12 N-terminome: WT / FtsH12 knockdown miRNA",118,33216923,"MaxQuant score",69.7370000,,-1.4157153,0.4155948,NO,0.00040509999962524,
VSSSAVKAPVSLDFETSVF,nt,V,69,true,"Arabidopsis translation initiation landscape - NT",167b,35069635,,,,,,,,
VSSSAVKAPVSLDFE,nt,V,69,true,"N-terminal ChaFRADIC",92,26010716,"MASCOT Score",34.1200000,,,,,1.1019999874406E-5,
VSSSAVKAPVSLDFE,nt,V,69,true,"Stromal N-terminome",96,26371235,"MASCOT Score",54.4800000,,,,,,
VSSSAVKAPVSLDFE,nt,V,69,true,"Arg/N-end rule seed, prt6 vs. Wt",99,29168982,"MASCOT Score",54.1700000,,0.5178568,0.1604305,NO,1.7669999144432E-11,-0.8454029
VSSSAVKAPVSLDFE,nt,V,69,true,"HUNTER N-terminome: legumain, GluC and trypsin",119,31951383,"MaxQuant score",244.7200000,,,,,,
VSSSAVKAPVSLD,nt,V,69,true,"HUNTER N-terminome: legumain, GluC and trypsin",119,31951383,"MaxQuant score",147.3700000,,,,,,
VSSSAVKAPVSLDFETSVF,nta,V,69,true,"Arabidopsis translation initiation landscape - NTA",167a,35069635,,,,,,,,
VSSSAVKAPVSLDFE,nta,V,69,true,"N-terminal ChaFRADIC",92,26010716,"MASCOT Score",34.1200000,,,,,1.1019999874406E-5,
VSSSAVKAPVSLDFE,nta,V,69,true,"Arg/N-end rule seed, prt6 vs. Wt",99,29168982,"MASCOT Score",54.1700000,,0.4251255,0.3417823,NO,1.7669999144432E-11,-0.8454029
VSSSAVKAPVSLDFE,nta,V,69,true,"HUNTER N-terminome: legumain, GluC and trypsin",119,31951383,"MaxQuant score",83.8690000,,,,,,
VSSSAVKAPVSLD,nta,V,69,true,"HUNTER N-terminome: legumain, GluC and trypsin",119,31951383,"MaxQuant score",96.3420000,,,,,,
SAVKAPVSLDFETSVF,nt,S,72,true,"Arabidopsis translation initiation landscape - NT",167b,35069635,,,,,,,,
SAVKAPVSLDFE,nt,S,72,true,"Stromal N-terminome",96,26371235,"MASCOT Score",65.0600000,,,,,,
AVKAPVSLDFETSVF,nt,A,73,true,"Arabidopsis translation initiation landscape - NT",167b,35069635,,,,,,,,
AVKAPVSLDFE,nt,A,73,true,"Stromal N-terminome",96,26371235,"MASCOT Score",56.0200000,,,,,,
AVKAPVSLDFE,nt,A,73,true,"HUNTER N-terminome: legumain, GluC and trypsin",119,31951383,"MaxQuant score",106.2000000,,,,,,
AVKAPVSLD,nt,A,73,true,"HUNTER N-terminome: legumain, GluC and trypsin",119,31951383,"MaxQuant score",75.7380000,,,,,,
VKAPVSLDFETSVF,nt,V,74,true,"Arabidopsis translation initiation landscape - NT",167b,35069635,,,,,,,,
VKAPVSLDFE,nt,V,74,true,"N-terminal ChaFRADIC",92,26010716,"MASCOT Score",35.9400000,,,,,0.0017800000496209,
VKAPVSLDFE,nta,V,74,true,"N-terminal ChaFRADIC",92,26010716,"MASCOT Score",35.9400000,,,,,0.0017800000496209,
APVSLDFETSVFKK,ph,S,85,true,"Tissue atlas Arabidopsis - ProteomicsDB",114,32188942,"MaxQuant score",166.7700000,0.9235020,,,,3.0464598739185E-16,
VSLAGYEEYIVR,ph,Y,97,true,"Tyrosine phosphorylation - flg22 vs mock",105,22074104,"MASCOT Score",79.5000000,,,,,,-1.1402969
VSLAGYEEYIVR,ph,Y,97,true,"Phospho cell culture sucrose/TOR",109,30833711,,,0.9953550,,,,,
VSLAGYEEYIVR,ph,Y,97,true,"Tissue atlas Arabidopsis - ProteomicsDB",114,32188942,"MaxQuant score",115.1800000,0.9862490,,,,0.00019134700414725,
DLFKHLPDAFK,ac,K,110,true,"Histone deacetylases - apicidin vs control",98a,29061669,"MaxQuant Score",109.0000000,1.0000000,0.0650000,0.8452788,NO,8.8999996705752E-8,
DLFKHLPDAFK,ac,K,110,true,"Histone deacetylases substrates - TSA vs control",98b,29061669,"MaxQuant Score",109.0000000,1.0000000,1.1830000,0.9397233,NO,8.8999996705752E-8,
DLFKHLPDAFK,ac,K,110,true,"Histone deacetylases- hda14 vs WT (low light)",98c,29061669,"MaxQuant Score",88.1000000,1.0000000,-2.7060000,0.2992265,NO,0.00047999998787418,
DLFKHLPDAFK,ac,K,110,true,"Histone deacetylases substrates - hda14 vs WT",98e,29061669,"MaxQuant Score",68.0000000,1.0000000,-0.0290000,0.9549926,NO,0.00053999997908249,
SQGPAQAQNLRDSLVE,nt,S,129,true,"N-terminal ChaFRADIC",92,26010716,"MASCOT Score",23.5600000,,,,,7.4559998211043E-6,
SQGPAQAQNLRDSLVE,nt,S,129,true,"Arabidopsis translation initiation landscape - NT",167b,35069635,,,,,,,,
DSLVEAKSDIVVK,ac,K,146,true,"Quantitative Acetylproteomics",101,29440448,,,,,,,,
DSLVEAKSDIVVK,ph,S,147,true,"Tissue atlas Arabidopsis - ProteomicsDB",114,32188942,"MaxQuant score",168.5500000,1.0000000,,,,1.0794399838495E-14,
SGTLGDIWE,nt,S,174,true,"N-terminal ChaFRADIC",92,26010716,"MASCOT Score",28.5200000,,,,,0.042739998549223,
DAAQADNYE,nt,D,196,true,"Arg/N-end rule seed, prt6 vs. Wt",99,29168982,"MASCOT Score",20.5900000,,-0.0144890,0.8999286,NO,0.046080000698566,-1.4523737
AAQADNYE,nt,A,197,true,"Arg/N-end rule seed, prt6 vs. Wt",99,29168982,"MASCOT Score",65.1500000,,-0.7985435,0.0528079,NO,0.00092909997329116,-1.0780002
NISVVAVCPK,ox,C,244,true,"OxiTRAQ Arabidopsis - 5 mM H2O2 versus control",47,24376095,,,,0.2107684,0.0733175,NO,,
NISVVAVCPK,sno,C,244,true,"Site-specific nitrosomeproteomic id - gsnor1-3",90a,25699590,XCorr,2.8530216,,,,,0.00078529998427257,-6.7670509
NISVVAVCPK,sno,C,244,true,"hot5-4 / wildtype, FAT-switch S-nitrosoproteome",169,37277371,,,,,,,,
NISVVAVCPK,so,C,244,true,"Arabidopsis S-sulfenylation chemoproteomics",108,31578252,"pFind PSM Score",0.0636458,,1.0597400,,,,0.6844470
NISVVAVCPK,so,C,244,true,"S-sulfenylation site detection using YAP1C",110,32714340,,,,,,,,
AVHGIVESLFR,nt,A,320,true,"Arabidopsis translation initiation landscape - NT",167b,35069635,,,,,,,,
GIVESLFR,nt,G,323,true,"Arg/N-end rule seed, prt6 vs. Wt",99,29168982,"MASCOT Score",43.2200000,,-0.3105054,0.4179975,NO,0.081119999289513,-0.7992343
NTVECITGTISR,nt,N,345,true,"Metacaspase9 substrates - in vitro rMC9",51c,23964026,"MASCOT Score",55.0000000,,2.4775418,,NO,,-0.7748095
NTVECITGTISR,sno,C,349,true,"Site-specific nitrosomeproteomic id - gsnor1-3",90a,25699590,XCorr,4.1937017,,,,,4.8239999159705E-6,-5.2780198
NTVECITGTISR,sno,C,349,true,"Site-specific nitrosomeproteomic id - gsnor1-3",90b,25699590,XCorr,3.1600000,,,,,0.00084719998994842,-7.3800000
NTVECITGTISR,sno,C,349,true,"hot5-4 / wildtype, FAT-switch S-nitrosoproteome",169,37277371,,,,,,,,
NTVECITGTISR,so,C,349,true,"Arabidopsis S-sulfenylation chemoproteomics",108,31578252,"pFind PSM Score",0.0001929,,0.9580300,,,,-0.6724008
NTVECITGTISR,so,C,349,true,"S-sulfenylation site detection using YAP1C",110,32714340,,,,,,,,
YEDVQSGSEIR,nt,Y,397,true,"Arg/N-end rule seed, prt6 vs. Wt",99,29168982,"MASCOT Score",44.8500000,,-0.1157996,0.2965763,NO,0.0078229997307062,-1.8634472
YEDVQSGSEIR,nta,Y,397,true,"FtsH12 N-terminome: WT / FtsH12 knockdown miRNA",118,33216923,"MaxQuant score",56.5990000,,-0.6655381,0.0175956,YES,2.0299999903273E-8,
SYSEIINESVIESVDSLNPFMHAR,nt,S,479,true,"Stromal N-terminome",96,26371235,"MASCOT Score",43.3100000,,,,,,
GVSFMVDNCSTTAR,sno,C,511,true,"hot5-4 / wildtype, FAT-switch S-nitrosoproteome",169,37277371,,,,0.5179374,0.1007440,NO,,
GVSFMVDNCSTTAR,so,C,511,true,"Arabidopsis S-sulfenylation chemoproteomics",108,31578252,"pFind PSM Score",0.0000019,,1.5372800,,,,-0.9923198
GVSFMVDNCSTTAR,so,C,511,true,"S-sulfenylation site detection using YAP1C",110,32714340,,,,,,,,
