Peptide,PTM,ModifiedAA,ModifiedPosition,PeptideUniqueToGene,ExperimentDesc,ExpID,PubmedID,ScoreType,IdentScore,LocProb,Log2FChange,PQ-val,QuantSig,PEP,MassErrorPPM
LSDDDDHAVNDSSEK,ph,S,64,true,"Tissue atlas Arabidopsis - ProteomicsDB",114,32188942,"MaxQuant score",123.5200000,0.9999990,,,,1.4012984643248E-45,
TDSVSSPETCEGVNVDK,ph,S,113,true,"Tissue atlas Arabidopsis - ProteomicsDB",114,32188942,"MaxQuant score",196.4500000,0.8957480,,,,2.4847600161653E-39,
VVEVWDDASNGGLSGGSENEAGDVK,ph,S,136,true,"TOR Kinase and ABA Receptor",100,29290610,XCorr,5.7844977,1.0000000,,,,3.7199998814685E-7,
VVEVWDDASNGGLSGGSENEAGDVK,ph,S,141,true,"TOR Kinase and ABA Receptor",100,29290610,XCorr,5.7844977,1.0000000,,,,3.7199998814685E-7,
VVEVWDDASNGGLSGGSENEAGDVK,ph,S,144,true,"TOR Kinase and ABA Receptor",100,29290610,XCorr,5.7844977,1.0000000,,,,3.7199998814685E-7,
NVSMIQR,ph,S,607,false,"srk2dei ABA signaling phopshoproteomics",83,23572148,"MASCOT Score",49.0000000,,,,,,-0.0001000
NVSMIQR,ph,S,607,false,"TOR Kinase and ABA Receptor",100,29290610,XCorr,2.3985250,1.0000000,,,,0.0069909999147058,
NVSMIQR,ph,S,607,false,"Lateral root-induction - NAA vs control",106,23328941,"MASCOT Score",24.0000000,,,,,,
NVSMIQR,ph,S,607,false,"Tissue atlas Arabidopsis - ProteomicsDB",114,32188942,"MaxQuant score",117.7600000,1.0000000,,,,0.0062271198257804,
