Peptide,PTM,ModifiedAA,ModifiedPosition,PeptideUniqueToGene,ExperimentDesc,ExpID,PubmedID,ScoreType,IdentScore,LocProb,Log2FChange,PQ-val,QuantSig,PEP,MassErrorPPM
ASLSVAADSAATESLGRIGSL,nt,A,45,true,"Arabidopsis translation initiation landscape - NT",167b,35069635,,,,,,,,
ASLSVAADSAATESLGR,nt,A,45,true,"Tic56 chloroplast import - tic56-1",89c,25588737,XCorr,3.1387143,,,,,,
ASLSVAADSAATESLGR,nt,A,45,true,"N-terminal ChaFRADIC",92,26010716,"MASCOT Score",80.0600000,,,,,5.7610001213959E-9,
ASLSVAADSAATESLGR,nt,A,45,true,"Stromal N-terminome",96,26371235,"MASCOT Score",105.0800000,,,,,,
ASLSVAADSAATESLGR,nt,A,45,true,"Arg/N-end rule seed, prt6 vs. Wt",99,29168982,"MASCOT Score",82.0600000,,0.1299244,0.1681520,NO,8.4790000983048E-5,-1.2715685
ASLSVAADSAATESLGR,nt,A,45,true,"FtsH12 N-terminome: WT / FtsH12 knockdown miRNA",118,33216923,"MaxQuant score",77.6770000,,,,,0.017518000677228,
ASLSVAADSAATESLGR,nt,A,45,true,"HUNTER N-terminome: legumain, GluC and trypsin",119,31951383,"MaxQuant score",174.3900000,,,,,,
ASLSVAADSAATE,nt,A,45,true,"N-terminal ChaFRADIC",92,26010716,"MASCOT Score",76.9500000,,,,,8.8599999799044E-6,
ASLSVAADSAATE,nt,A,45,true,"Arg/N-end rule seed, prt6 vs. Wt",99,29168982,"MASCOT Score",65.2200000,,-0.1063162,0.6237988,NO,6.2399999478657E-6,-1.5159225
ASLSVAADSAATE,nt,A,45,true,"HUNTER N-terminome: legumain, GluC and trypsin",119,31951383,"MaxQuant score",152.1100000,,,,,,
ASLSVAADSAATESLGRIGSL,nta,A,45,true,"Arabidopsis translation initiation landscape - NTA",167a,35069635,,,,,,,,
ASLSVAADSAATESLGR,nta,A,45,true,"N-terminal ChaFRADIC",92,26010716,"MASCOT Score",73.7000000,,,,,4.6630000838377E-7,
ASLSVAADSAATESLGR,nta,A,45,true,"Stromal N-terminome",96,26371235,"MASCOT Score",57.1100000,,,,,,
ASLSVAADSAATE,nta,A,45,true,"N-terminal ChaFRADIC",92,26010716,"MASCOT Score",21.0600000,,,,,0.014689999632537,
SLSVAADSAATESLGRIGSLSQVSGVL,nt,S,46,true,"Arabidopsis translation initiation landscape - NT",167b,35069635,,,,,,,,
SLSVAADSAATESLGR,nt,S,46,true,"Arg/N-end rule pathway Roots",80,25728785,"MASCOT Score",78.3000000,,,,,3.9820001802582E-6,
SLSVAADSAATESLGR,nt,S,46,true,"Tic56 chloroplast import - wild-type",89a,25588737,XCorr,3.5589604,,,,,,
SLSVAADSAATESLGR,nt,S,46,true,"Tic56 chloroplast import - ppi2",89b,25588737,XCorr,3.9874177,,,,,,
SLSVAADSAATESLGR,nt,S,46,true,"Tic56 chloroplast import - tic56-1",89c,25588737,XCorr,4.9211106,,,,,,
SLSVAADSAATESLGR,nt,S,46,true,"N-terminal ChaFRADIC",92,26010716,"MASCOT Score",92.2700000,,,,,1.0349999968184E-7,
SLSVAADSAATESLGR,nt,S,46,true,"Stromal N-terminome",96,26371235,"MASCOT Score",103.3700000,,,,,,
SLSVAADSAATESLGR,nt,S,46,true,"Arg/N-end rule seed, prt6 vs. Wt",99,29168982,"MASCOT Score",123.0600000,,0.0559940,0.7154753,NO,6.8370000008144E-6,-1.3723523
SLSVAADSAATESLGR,nt,S,46,true,"HUNTER N-terminome: legumain, GluC and trypsin",119,31951383,"MaxQuant score",250.6900000,,,,,,
SLSVAADSAATE,nt,S,46,true,"N-terminal ChaFRADIC",92,26010716,"MASCOT Score",67.4100000,,,,,4.4079999497626E-5,
SLSVAADSAATE,nt,S,46,true,"Arg/N-end rule seed, prt6 vs. Wt",99,29168982,"MASCOT Score",51.5600000,,0.2995606,0.1613248,NO,1.9900000552298E-5,0.0389859
SLSVAADSAATE,nt,S,46,true,"HUNTER N-terminome: legumain, GluC and trypsin",119,31951383,"MaxQuant score",167.2300000,,,,,,
SLSVAADSAATESLGRIGSLSQVSGVL,nta,S,46,true,"Arabidopsis translation initiation landscape - NTA",167a,35069635,,,,,,,,
SLSVAADSAATESLGR,nta,S,46,true,"Characterization plant N-terminal acetylation",6,22223895,"MASCOT Score",85.3500000,,,,,,
SLSVAADSAATESLGR,nta,S,46,true,"N-terminal ChaFRADIC",92,26010716,"MASCOT Score",92.2700000,,,,,1.0349999968184E-7,
SLSVAADSAATESLGR,nta,S,46,true,"Stromal N-terminome",96,26371235,"MASCOT Score",86.2400000,,,,,,
SLSVAADSAATESLGR,nta,S,46,true,"Arg/N-end rule seed, prt6 vs. Wt",99,29168982,"MASCOT Score",123.0600000,,,,,6.8370000008144E-6,-1.3723523
SLSVAADSAATESLGR,nta,S,46,true,"FtsH12 N-terminome: WT / FtsH12 knockdown miRNA",118,33216923,"MaxQuant score",50.5310000,,,,,7.3900001673621E-9,
SLSVAADSAATESLGR,nta,S,46,true,"HUNTER N-terminome: legumain, GluC and trypsin",119,31951383,"MaxQuant score",80.4690000,,,,,,
SLSVAADSAATE,nta,S,46,true,"N-terminal ChaFRADIC",92,26010716,"MASCOT Score",29.3300000,,,,,0.029060000553727,
SLSVAADSAATE,nta,S,46,true,"HUNTER N-terminome: legumain, GluC and trypsin",119,31951383,"MaxQuant score",243.3800000,,,,,,
SVAADSAATESLGR,nt,S,48,true,"Arg/N-end rule seed, prt6 vs. Wt",99,29168982,"MASCOT Score",45.3500000,,0.2093438,0.2320933,NO,0.018969999626279,0.3952870
SVAADSAATESLGR,nt,S,48,true,"Arabidopsis translation initiation landscape - NT",167b,35069635,,,,,,,,
SVAADSAATE,nt,S,48,true,"N-terminal ChaFRADIC",92,26010716,"MASCOT Score",53.2200000,,,,,0.00044440000783652,
VAADSAATESLGR,nt,V,49,true,"Arg/N-end rule pathway Roots",80,25728785,"MASCOT Score",39.5600000,,,,,0.0038469999562949,
VAADSAATESLGR,nt,V,49,true,"Tic56 chloroplast import - tic56-1",89c,25588737,XCorr,2.7777066,,,,,,
VAADSAATESLGR,nt,V,49,true,"Arabidopsis translation initiation landscape - NT",167b,35069635,,,,,,,,
IGSLSQVSGVLGCQWGDEGKGK,so,C,74,true,"S-sulfenylation site detection using YAP1C",110,32714340,,,,,,,,
CQGGANAGHTIYNSEGKK,cn,C,98,true,"Cellular regulation by S-cyanylation",115,30377236,,,,,,,,
QGGANAGHTIYNSE,nt,Q,99,true,"Arg/N-end rule seed, prt6 vs. Wt",99,29168982,"MASCOT Score",43.4600000,,-0.1496366,0.5747570,NO,0.0017099999822676,0.2554802
EIDGLESNGVSCK,so,C,159,true,"Arabidopsis S-sulfenylation chemoproteomics",108,31578252,"pFind PSM Score",0.0999644,,1.0989000,,,,-2.2954096
ESELAKSFIGTTK,ac,K,189,true,"Quantitative Acetylproteomics",101,29440448,,,,,,,,
ESELAKSFIGTTKR,ub,K,189,true,"Arabidopsis ubiquitination COFRADIC",40,26744219,"MaxQuant Score",60.1960000,1.0000000,,,,6.299999949988E-5,0.6820000
SFIGTTKR,ph,T,195,true,"Tissue atlas Arabidopsis - ProteomicsDB",114,32188942,"MaxQuant score",115.7000000,0.8812990,,,,0.0076564000919461,
SFIGTTKR,ac,K,196,true,"Quantitative Acetylproteomics",101,29440448,,,,,,,,
GIGPAYSSKVIR,nt,G,198,true,"Arabidopsis translation initiation landscape - NT",167b,35069635,,,,,,,,
EEVEAYKR,ac,K,256,true,"Quantitative Acetylproteomics",101,29440448,,,,,,,,
VGSGPFPTENLGTGGDLLR,ph,S,340,true,"Tissue atlas Arabidopsis - ProteomicsDB",114,32188942,"MaxQuant score",173.2100000,1.0000000,,,,1.8905699909789E-28,
VGSGPFPTENLGTGGDLLR,ph,T,350,true,"Phospho cell culture sucrose/TOR",109,30833711,,,0.9998280,,,,,
VGSGPFPTENLGTGGDLLR,ph,T,350,true,"Tissue atlas Arabidopsis - ProteomicsDB",114,32188942,"MaxQuant score",193.3600000,1.0000000,,,,2.8025969286496E-45,
LAGQEFGTTTGRPR,ph,T,364,true,"STN8 phosphoproteome",38,21768351,"MASCOT Score",45.4200000,,,,,,0.5996410
LAGQEFGTTTGRPR,ph,T,364,true,"Phosphoproteome ethylene-regulated time response",46,24043427,"MASCOT Score",94.8000000,,,,,,2.6039000
LAGQEFGTTTGRPR,ph,T,364,true,"srk2dei ABA signaling phopshoproteomics",83,23572148,"MASCOT Score",61.0000000,,,,,,-0.0008000
LAGQEFGTTTGRPR,ph,T,364,true,"atm and atr DNA damage response",88,25561503,"MASCOT Score",66.0000000,0.9370000,,,,,-0.0500000
LAGQEFGTTTGRPR,ph,T,364,true,"TOR Kinase and ABA Receptor",100,29290610,XCorr,3.5987265,0.9089000,,,,0.0067059998400509,
LAGQEFGTTTGRPR,ph,T,364,true,"Phospho cell culture sucrose/TOR",109,30833711,,,0.8663090,,,,,
LAGQEFGTTTGRPR,ph,T,364,true,"Tissue atlas Arabidopsis - ProteomicsDB",114,32188942,"MaxQuant score",179.1400000,0.9888650,,,,6.3533197543156E-23,
LAGQEFGTTTGR,ph,T,364,true,"atm and atr DNA damage response",88,25561503,"MASCOT Score",56.0000000,0.9580000,,,,,0.5000000
LAGQEFGTTTGRPR,ph,T,365,true,"srk2dei ABA signaling phopshoproteomics",83,23572148,"MASCOT Score",53.0000000,,,,,,-0.0013000
LAGQEFGTTTGRPR,ph,T,365,true,"SnRK2 protein kinase substrates",85,23776212,XCorr,2.4653809,0.9290000,,,,0.00099961599335074,
LAGQEFGTTTGRPR,ph,T,366,true,"srk2dei ABA signaling phopshoproteomics",83,23572148,"MASCOT Score",27.0000000,,,,,,-0.0012000
CGWLDIVALK,ox,C,372,true,"SPEAR - 50 mM H2O2 / mock",138b,34619326,,,,1.6902708,0.0302398,YES,,
SDGTPVKSFPGDLR,nt,S,415,true,"Arabidopsis translation initiation landscape - NT",167b,35069635,,,,,,,,
SDGTPVKSFPGDLR,ac,K,421,true,"Quantitative Acetylproteomics",101,29440448,,,,,,,,
