Peptide,PTM,ModifiedAA,ModifiedPosition,PeptideUniqueToGene,ExperimentDesc,ExpID,PubmedID,ScoreType,IdentScore,LocProb,Log2FChange,PQ-val,QuantSig,PEP,MassErrorPPM
GNCCGTAGSLAQNDNKPK,myr,G,2,true,"N-Terminal Myristoylated Proteins",102,29453228,,,,,,,,
QNPFSIDYGLHHGGGDGGGRPLK,ph,S,29,true,"Tissue atlas Arabidopsis - ProteomicsDB",114,32188942,"MaxQuant score",49.7930000,0.9967720,,,,0.00034523400245234,
KMLDPDQKR,ac,K,307,true,"Quantitative Acetylproteomics",101,29440448,,,,,,,,
TAPNVSLGETVR,ph,T,335,true,"Tissue atlas Arabidopsis - ProteomicsDB",114,32188942,"MaxQuant score",133.9100000,0.9999450,,,,7.7900898759253E-5,
VIAEHLSDEEASGIR,ph,S,362,true,"Phytohormone-responsive phosphoproteins",34,20374526,"MASCOT Score",49.0000000,,,,,,8.5494100
VIAEHLSDEEASGIR,ph,S,362,true,"Tissue atlas Arabidopsis - ProteomicsDB",114,32188942,"MaxQuant score",121.8200000,0.9999390,,,,3.1307999961427E-6,
VIAEHLSDEEASGIR,ph,S,367,true,"Tissue atlas Arabidopsis - ProteomicsDB",114,32188942,"MaxQuant score",185.1400000,0.9999850,,,,2.4167000350479E-25,
EGFQIMDTSQRGK,ph,T,378,true,"TOR Kinase and ABA Receptor",100,29290610,XCorr,3.1222055,0.9986000,,,,0.005133000202477,
EGFQIMDTSQR,ph,T,378,true,"Phospho cell culture sucrose/TOR",109,30833711,,,0.7540510,,,,,
EGFQIMDTSQR,ph,T,378,true,"Tissue atlas Arabidopsis - ProteomicsDB",114,32188942,"MaxQuant score",164.1100000,0.8299100,,,,1.4273099369078E-10,
EGFQIMDTSQR,ph,S,379,true,"ABA-induced protein phosphorylation",35,20733066,,,,,,,,
EGFQIMDTSQR,ph,S,379,true,"Large-scale phosphorylation discovery",44,23111157,XCorr,3.2040000,,,,,,
EGFQIMDTSQR,ph,S,379,true,"Tyrosine phosphorylation in Arabidopsis",59,18463617,"MASCOT Score",43.0000000,,,,,,-0.3595678
EGFQIMDTSQR,ph,S,379,true,"atm and atr DNA damage response",88,25561503,"MASCOT Score",57.0000000,0.9980000,,,,,0.0200000
EGFQIMDTSQR,ph,S,379,true,"Phospho cell culture sucrose/TOR",109,30833711,,,0.9297860,,,,,
EGFQIMDTSQR,ph,S,379,true,"Tissue atlas Arabidopsis - ProteomicsDB",114,32188942,"MaxQuant score",200.9800000,0.9804930,,,,1.0998400219658E-19,
DVDTDKDGR,ac,K,487,false,"Quantitative Acetylproteomics",101,29440448,,,,,,,,
ERFNSISLK,ph,S,520,true,"atm and atr DNA damage response",88,25561503,"MASCOT Score",29.0000000,1.0000000,,,,,-0.7900000
ERFNSISLK,ph,S,522,true,"atm and atr DNA damage response",88,25561503,"MASCOT Score",24.0000000,0.9950000,,,,,-0.9800000
FNSISLK,ph,S,522,true,"TOR Kinase and ABA Receptor",100,29290610,XCorr,2.6249816,0.9953000,,,,0.087590001523495,
