Peptide,PTM,ModifiedAA,ModifiedPosition,PeptideUniqueToGene,ExperimentDesc,ExpID,PubmedID,ScoreType,IdentScore,LocProb,Log2FChange,PQ-val,QuantSig,PEP,MassErrorPPM
SGSTKVLDPAFQGVGQKPGTEIWR,nt,S,2,true,"Arg/N-end rule seed, prt6 vs. Wt",99,29168982,"MASCOT Score",32.7300000,,,,,0.0007636999944225,3.6016232
SGSTKVLDPAFQGVG,nt,S,2,true,"Arg/N-end rule seed, prt6 vs. Wt",99,29168982,"MASCOT Score",34.3100000,,,,,0.029810000211,-2.3443935
SGSTKVLDPA,nt,S,2,true,"N-term acetylation drought responses",5,26184543,,,,,,,,
SGSTKVLDPAFQGVGQKPGTEIWRIEN,nta,S,2,true,"HUNTER N-terminome: legumain, GluC and trypsin",119,31951383,"MaxQuant score",67.5860000,,,,,,
SGSTKVLDPAFQGVGQKPGTEIWR,nta,S,2,true,"Arg/N-end rule pathway Roots",80,25728785,"MASCOT Score",60.7800000,,,,,8.5229999058356E-8,
SGSTKVLDPAFQGVGQKPGTEIWR,nta,S,2,true,"Arg/N-end rule seed, prt6 vs. Wt",99,29168982,"MASCOT Score",32.7300000,,-0.2422223,0.3734278,NO,0.0007636999944225,3.6016232
SGSTKVLDPAFQGVGQKPGTEIWR,nta,S,2,true,"HUNTER N-terminome: legumain, GluC and trypsin",119,31951383,"MaxQuant score",40.1420000,,,,,,
SGSTKVLDPAFQGVG,nta,S,2,true,"Arg/N-end rule seed, prt6 vs. Wt",99,29168982,"MASCOT Score",34.3100000,,-0.0925223,0.1494165,NO,0.029810000211,-2.3443935
SGSTKVLDPA,nta,S,2,true,"N-term acetylation drought responses",5,26184543,,,,,,,,
STKVLDPAFQ,nt,S,4,false,"Arg/N-end rule seed, prt6 vs. Wt",99,29168982,"MASCOT Score",66.6900000,,,,,1.532000055704E-6,-3.7033056
STKVLDPAFQ,nta,S,4,false,"Arg/N-end rule seed, prt6 vs. Wt",99,29168982,"MASCOT Score",66.6900000,,-0.3851749,0.0438175,NO,1.532000055704E-6,-3.7033056
SGSTKVLDPAFQGVGQKPGTEIWR,ub,K,6,true,"upl3 mutant / wildtype",168,35926874,"MaxQuant score",54.5210000,1.0000000,-0.5756153,0.3537800,NO,2.6107200028491E-5,0.5058300
IENFEPVPVPKSEHGK,ac,K,36,true,"Quantitative Acetylproteomics",101,29440448,,,,,,,,
PCIIPLEGGVASGFK,ox,C,117,false,"SPEAR - 10 mM H2O2 / mock",138a,34619326,,,,-1.5760550,0.0136449,YES,,
PCIIPLEGGVASGFK,ox,C,117,false,"SPEAR - 50 mM H2O2 / mock",138b,34619326,,,,-2.5445607,0.0001564,YES,,
KVASEDEIIPETTPPK,ph,S,243,true,"Large-scale phosphorylation discovery",44,23111157,XCorr,3.9150000,,,,,,
KVASEDEIIPETTPPK,ph,S,243,true,"Tissue atlas Arabidopsis - ProteomicsDB",114,32188942,"MaxQuant score",130.5600000,1.0000000,,,,2.8334199431157E-9,
SNFDSWPSGSATPANEEGR,ph,T,350,true,"Tissue atlas Arabidopsis - ProteomicsDB",114,32188942,"MaxQuant score",197.0000000,0.9978160,,,,1.4012984643248E-45,
VAALLKQQGVGLK,ub,K,365,false,"upl3 mutant / wildtype",168,35926874,"MaxQuant score",98.8980000,1.0000000,-0.3789445,0.6222800,NO,1.6885500372155E-5,0.8904100
VAEFLKPGTTIK,ph,T,587,true,"Tissue atlas Arabidopsis - ProteomicsDB",114,32188942,"MaxQuant score",150.2200000,0.8326290,,,,3.9178598854051E-7,
YINLAGSLEGLSPK,ph,S,696,true,"Tissue atlas Arabidopsis - ProteomicsDB",114,32188942,"MaxQuant score",212.3500000,0.9999990,,,,4.4140901626232E-43,
GTHHVVEDQSSSGNQGPR,nt,G,740,true,"Tic56 chloroplast import - tic56-1",89c,25588737,XCorr,3.6060815,,,,,,
THHVVEDQSSSGNQGPR,nt,T,741,true,"Tic56 chloroplast import - tic56-1",89c,25588737,XCorr,4.2373543,,,,,,
HVVEDQSSSGNQGPR,nt,H,743,true,"Tic56 chloroplast import - tic56-1",89c,25588737,XCorr,3.3976977,,,,,,
HVVEDQSSSGNQGPR,nt,H,743,true,"Arg/N-end rule seed, prt6 vs. Wt",99,29168982,"MASCOT Score",59.8500000,,-2.0506956,0.1772330,NO,0.00040270001045428,-1.5718026
AAALAALTSAFNSSSGR,ph,S,768,true,"Large-scale phosphorylation discovery",44,23111157,XCorr,4.9670000,,,,,,
AAALAALTSAFNSSSGR,ph,S,768,true,"Tissue atlas Arabidopsis - ProteomicsDB",114,32188942,"MaxQuant score",211.4500000,0.9960170,,,,0,
AAALAALTSAFNSSSGR,ph,S,772,true,"atm and atr DNA damage response",88,25561503,"MASCOT Score",53.0000000,0.9070000,,,,,1.4600000
AAALAALTSAFNSSSGR,ph,S,774,true,"Large-scale phosphorylation discovery",44,23111157,XCorr,5.3740000,,,,,,
AEALAALTSAFNSSPSSKSPPR,ph,S,804,true,"Tissue atlas Arabidopsis - ProteomicsDB",114,32188942,"MaxQuant score",95.2550000,0.7745220,,,,1.579050041764E-12,
AEALAALTSAFNSSPSSKSPPRR,ph,S,809,true,"MAPK Arabidopsis substrates",45,23172892,"MaxQuant Score",118.2400000,,,,,,
AEALAALTSAFNSSPSSK,ph,S,809,true,"Large-scale phosphorylation discovery",44,23111157,XCorr,4.7620000,,,,,,
AEALAALTSAFNSSPSSK,ph,S,809,true,"SnRK2 protein kinase substrates",85,23776212,XCorr,3.2865953,0.9460000,,,,2.8322800062597E-5,
AEALAALTSAFNSSPSSK,ph,S,809,true,"atm and atr DNA damage response",88,25561503,"MASCOT Score",42.0000000,0.9960000,,,,,-1.2400000
AEALAALTSAFNSSPSSK,ph,S,809,true,"Tissue atlas Arabidopsis - ProteomicsDB",114,32188942,"MaxQuant score",231.8500000,0.7602170,,,,0,
AEALAALTSAFNSSPSSKSPPRR,ph,S,811,true,"atm and atr DNA damage response",88,25561503,"MASCOT Score",35.0000000,0.9860000,,,,,-1.5700000
AEALAALTSAFNSSPSSKSPPRR,ph,S,811,true,"Tissue atlas Arabidopsis - ProteomicsDB",114,32188942,"MaxQuant score",235.9000000,0.8157540,,,,0,
AEALAALTSAFNSSPSSKSPPR,ph,S,811,true,"Col-0 callus - FC Col-0 vs. Col-0 Xray",111a,31410901,,50.1900000,,1.1250629,0.0000000,NO,,1.0619415
AEALAALTSAFNSSPSSKSPPR,ph,S,811,true,"Col-0 X-ray callus - FC Col-0 vs. Col-0 Xray",111b,31410901,,50.1900000,,1.1250629,0.0000000,NO,,1.0619415
AEALAALTSAFNSSPSSKSPPR,ph,S,811,true,"atm callus - FC atm vs. atm Xray",111c,31410901,,50.1900000,,1.4648104,0.0000000,NO,,1.0619415
AEALAALTSAFNSSPSSKSPPR,ph,S,811,true,"atm-3 X-ray callus - FC atm vs. atm Xray",111d,31410901,,50.1900000,,1.4648104,0.0000000,NO,,1.0619415
AEALAALTSAFNSSPSSKSPPRR,ph,S,812,true,"Phosphoproteome ethylene-regulated time response",46,24043427,"MASCOT Score",46.2600000,,,,,,-10.1050000
AEALAALTSAFNSSPSSKSPPRR,ph,S,812,true,"atm and atr DNA damage response",88,25561503,"MASCOT Score",40.0000000,0.8310000,,,,,-0.9400000
AEALAALTSAFNSSPSSKSPPR,ph,S,812,true,"Col-0 callus - FC Col-0 vs. Col-0 Xray",111a,31410901,,52.5400000,,1.1060862,0.0389552,YES,,0.4840278
AEALAALTSAFNSSPSSKSPPR,ph,S,812,true,"Col-0 X-ray callus - FC Col-0 vs. Col-0 Xray",111b,31410901,,52.5400000,,1.1060862,0.0389552,YES,,0.4840278
AEALAALTSAFNSSPSSKSPPR,ph,S,812,true,"atm callus - FC atm vs. atm Xray",111c,31410901,,52.5400000,,0.0649160,0.8982385,NO,,0.4840278
AEALAALTSAFNSSPSSKSPPR,ph,S,812,true,"atm-3 X-ray callus - FC atm vs. atm Xray",111d,31410901,,52.5400000,,0.0649160,0.8982385,NO,,0.4840278
QRAEALAALTSAFNSSPSSKSPPR,ph,S,814,true,"MAPK Arabidopsis substrates",45,23172892,"MaxQuant Score",184.6000000,,,,,,
QRAEALAALTSAFNSSPSSKSPPR,ph,S,814,true,"PAMP-triggered phosphorylation",48,24601666,"MASCOT Score",43.9300000,,,,,,
QRAEALAALTSAFNSSPSSKSPPR,ph,S,814,true,"TOR Kinase and ABA Receptor",100,29290610,XCorr,4.0167999,0.9930000,,,,6.1840000853408E-6,
AEALAALTSAFNSSPSSKSPPRR,ph,S,814,true,"Arabidopsis root NAA phosphoproteome",18a,27643528,"MaxQuant Score",114.4900000,0.8330000,,,,3.1850000120168E-18,0.3140000
AEALAALTSAFNSSPSSKSPPRR,ph,S,814,true,"Phosphoproteome ethylene-regulated time response",46,24043427,"MASCOT Score",95.2000000,,,,,,15.9744000
AEALAALTSAFNSSPSSKSPPRR,ph,S,814,true,"PAMP-triggered phosphorylation",48,24601666,"MASCOT Score",66.0000000,,,,,,
AEALAALTSAFNSSPSSKSPPRR,ph,S,814,true,"atm and atr DNA damage response",88,25561503,"MASCOT Score",46.0000000,0.9080000,,,,,-0.2000000
AEALAALTSAFNSSPSSKSPPR,ph,S,814,true,"Phosphoproteome ethylene-regulated time response",46,24043427,"MASCOT Score",50.8200000,,,,,,-10.2664000
AEALAALTSAFNSSPSSKSPPR,ph,S,814,true,"PAMP-triggered phosphorylation",48,24601666,"MASCOT Score",67.9200000,,,,,,
AEALAALTSAFNSSPSSKSPPR,ph,S,814,true,"atm and atr DNA damage response",88,25561503,"MASCOT Score",41.0000000,0.8910000,,,,,0.8100000
AEALAALTSAFNSSPSSKSPPR,ph,S,814,true,"Tissue atlas Arabidopsis - ProteomicsDB",114,32188942,"MaxQuant score",295.9900000,0.9993480,,,,0,
SGLTSQASQR,ph,S,819,true,"atm and atr DNA damage response",88,25561503,"MASCOT Score",48.0000000,1.0000000,,,,,-0.6400000
SGLTSQASQR,ph,S,819,true,"Tissue atlas Arabidopsis - ProteomicsDB",114,32188942,"MaxQuant score",135.1600000,0.9999840,,,,1.727520066197E-5,
RSGLTSQASQR,ph,S,826,true,"atm and atr DNA damage response",88,25561503,"MASCOT Score",42.0000000,1.0000000,,,,,0.6000000
SGLTSQASQR,ph,S,826,true,"atm and atr DNA damage response",88,25561503,"MASCOT Score",66.0000000,1.0000000,,,,,-0.3500000
SGLTSQASQR,ph,S,826,true,"Protein sumoylation and phosphorylation cross-talk",97,28419593,,,,,,,,
SGLTSQASQR,ph,S,826,true,"TOR Kinase and ABA Receptor",100,29290610,XCorr,3.2972846,0.9999000,,,,0.0049200002104044,
SGLTSQASQR,ph,S,826,true,"Phospho cell culture sucrose/TOR",109,30833711,,,0.9999740,,,,,
SGLTSQASQR,ph,S,826,true,"Tissue atlas Arabidopsis - ProteomicsDB",114,32188942,"MaxQuant score",199.8200000,1.0000000,,,,2.3201399636697E-14,
AAAVAALSQVLTAEK,ph,S,836,true,"Tissue atlas Arabidopsis - ProteomicsDB",114,32188942,"MaxQuant score",168.9100000,0.9999730,,,,9.6970399753204E-18,
AAAVAALSQVLTAEK,ph,T,840,true,"Large-scale phosphorylation discovery",44,23111157,XCorr,4.8430000,,,,,,
AAAVAALSQVLTAEK,ph,T,840,true,"Tissue atlas Arabidopsis - ProteomicsDB",114,32188942,"MaxQuant score",206.2700000,1.0000000,,,,1.1210387714599E-44,
KSPDTSPSAEAKDEK,ph,S,846,true,"Phospho cell culture sucrose/TOR",109,30833711,,,0.9942940,,,,,
SPDTSPSAEAKDEK,ph,S,846,true,"Tissue atlas Arabidopsis - ProteomicsDB",114,32188942,"MaxQuant score",197.1000000,0.9999990,,,,9.7629902779296E-30,
KKSPDTSPSAEAK,ph,S,846,true,"LAXIC - mannitol vs control",84b,23660473,XCorr,4.4800000,1.0000000,,,,0.00021516700508073,
KKSPDTSPSAEAK,ph,S,846,true,"SnRK2 protein kinase substrates",85,23776212,XCorr,4.9070306,0.9980000,,,,0.012018299661577,
KKSPDTSPSAEAK,ph,S,846,true,"atm and atr DNA damage response",88,25561503,"MASCOT Score",46.0000000,1.0000000,,,,,-2.7600000
KKSPDTSPSAEAK,ph,S,846,true,"TOR Kinase and ABA Receptor",100,29290610,XCorr,3.2906125,0.9932000,,,,2.7880000743608E-6,
KSPDTSPSAEAK,ph,S,846,true,"Large-scale phosphorylation discovery",44,23111157,XCorr,3.5890000,,,,,,
KSPDTSPSAEAK,ph,S,846,true,"atm and atr DNA damage response",88,25561503,"MASCOT Score",39.0000000,1.0000000,,,,,-0.9300000
KKSPDTSPSAEAK,ph,S,850,true,"LAXIC - mannitol vs control",84b,23660473,XCorr,4.4800000,0.9630000,,,,0.00021516700508073,
KKSPDTSPSAEAK,ph,S,850,true,"SnRK2 protein kinase substrates",85,23776212,XCorr,4.9070306,0.9550000,,,,0.012018299661577,
KSPDTSPSAEAK,ph,S,850,true,"Large-scale phosphorylation discovery",44,23111157,XCorr,4.2190000,,,,,,
KSPDTSPSAEAK,ph,S,850,true,"atm and atr DNA damage response",88,25561503,"MASCOT Score",39.0000000,0.9970000,,,,,-0.9300000
SPDTSPSAEAK,ph,S,850,true,"Tissue atlas Arabidopsis - ProteomicsDB",114,32188942,"MaxQuant score",247.2100000,0.9987580,,,,0,
KSPDTSPSAEAK,ph,S,852,true,"Large-scale phosphorylation discovery",44,23111157,XCorr,4.4840000,,,,,,
AFSEVEATEEATEAKEEEEVSPAAEASAEEAKPK,ph,S,862,true,"PAMP-triggered phosphorylation",48,24601666,"MASCOT Score",73.6500000,,,,,,
AFSEVEATEEATEAKEEEEVSPAAEASAEEAKPK,ph,S,862,true,"Tissue atlas Arabidopsis - ProteomicsDB",114,32188942,"MaxQuant score",269.3000000,1.0000000,,,,0,
DEKAFSEVEATEEATEAK,ph,S,862,true,"STN8 phosphoproteome",38,21768351,"MASCOT Score",70.8300000,,,,,,-2.8352200
AFSEVEATEEATEAK,ph,S,862,true,"STN8 phosphoproteome",38,21768351,"MASCOT Score",79.8500000,,,,,,-1.2839600
AFSEVEATEEATEAK,ph,S,862,true,"srk2dei ABA signaling phopshoproteomics",83,23572148,"MASCOT Score",37.0000000,,,,,,0.0018000
AFSEVEATEEATEAK,ph,S,862,true,"TOR Kinase and ABA Receptor",100,29290610,XCorr,4.2073383,1.0000000,,,,8.7569998186154E-7,
AFSEVEATEEATEAKEEEEVSPAAEASAEEAKPK,ph,S,880,true,"SnRK2 protein kinase substrates",85,23776212,XCorr,6.1651344,1.0000000,,,,9.582179671952E-8,
AFSEVEATEEATEAKEEEEVSPAAEASAEEAKPK,ph,S,880,true,"Phospho cell culture sucrose/TOR",109,30833711,,,0.8484430,,,,,
EEEEVSPAAEASAEEAKPK,ph,S,880,true,"STN8 phosphoproteome",38,21768351,"MASCOT Score",80.8300000,,,,,,-1.2999600
EEEEVSPAAEASAEEAKPK,ph,S,880,true,"Chloroplast kinase substrates",60,19376835,"MASCOT Score",80.8200000,,,,,,-1.2999600
EEEEVSPAAEASAEEAKPK,ph,S,880,true,"Tissue atlas Arabidopsis - ProteomicsDB",114,32188942,"MaxQuant score",300.8700000,1.0000000,,,,0,
SEKPVTGIDFK,ph,S,915,true,"Tissue atlas Arabidopsis - ProteomicsDB",114,32188942,"MaxQuant score",82.7050000,0.9999940,,,,0.0016700699925423,
SEKPVTGIDFKR,ac,K,925,true,"Quantitative Acetylproteomics",101,29440448,,,,,,,,
