Peptide,PTM,ModifiedAA,ModifiedPosition,PeptideUniqueToGene,ExperimentDesc,ExpID,PubmedID,ScoreType,IdentScore,LocProb,Log2FChange,PQ-val,QuantSig,PEP,MassErrorPPM
FRIPKPEDEVDYYGSSSQDESR,ph,S,40,true,"Tissue atlas Arabidopsis - ProteomicsDB",114,32188942,"MaxQuant score",102.3800000,0.7957810,,,,7.1769799304955E-12,
IPKPEDEVDYYGSSSQDESR,ph,S,41,true,"Tissue atlas Arabidopsis - ProteomicsDB",114,32188942,"MaxQuant score",101.7400000,0.8885210,,,,7.1769799304955E-12,
FYDMDNSPNFAADVTPHRR,ph,T,161,true,"Tissue atlas Arabidopsis - ProteomicsDB",114,32188942,"MaxQuant score",79.9350000,0.9657100,,,,1.300629992329E-5,
ALSPSNSTPNFSLK,ph,S,265,true,"atm and atr DNA damage response",88,25561503,"MASCOT Score",37.0000000,1.0000000,,,,,0.4800000
ALSPSNSTPNFSLK,ph,S,265,true,"TOR Kinase and ABA Receptor",100,29290610,XCorr,3.5028183,0.9997000,,,,0.0024210000410676,
ALSPSNSTPNFSLK,ph,S,265,true,"Tissue atlas Arabidopsis - ProteomicsDB",114,32188942,"MaxQuant score",139.8600000,0.9999800,,,,4.9524100376175E-8,
ALSPSNSTPNFSLK,ph,S,269,true,"Tissue atlas Arabidopsis - ProteomicsDB",114,32188942,"MaxQuant score",114.6900000,0.8659280,,,,5.642640098813E-5,
WERQFLDELVNSLMESK,ph,S,1034,true,"srk2dei ABA signaling phopshoproteomics",83,23572148,"MASCOT Score",28.0000000,,,,,,-0.0047000
AKEEANGEDTPQR,ph,T,1467,true,"Tissue atlas Arabidopsis - ProteomicsDB",114,32188942,"MaxQuant score",90.8060000,1.0000000,,,,0.00017573799414095,
GFDPSSSAN,ph,S,1505,true,"atm and atr DNA damage response",88,25561503,"MASCOT Score",46.0000000,0.9970000,,,,,0.2800000
