Peptide,PTM,ModifiedAA,ModifiedPosition,PeptideUniqueToGene,ExperimentDesc,ExpID,PubmedID,ScoreType,IdentScore,LocProb,Log2FChange,PQ-val,QuantSig,PEP,MassErrorPPM
AEVDISHSKKK,ph,S,7,true,"SIRK1 phosphorylation",86a,23820729,"MaxQuant Score",98.7090000,1.0000000,,,,0.079000003635883,2.4260000
AEVDISHSKKK,ph,S,7,true,"SIRK1 exp - sirk1 mutant vs WT",86b,23820729,,,,-0.6937997,,NO,,
AEVDISHSKKK,ph,S,7,true,"SIRK1 exp - 35S:SIRK1 vs WT",86c,23820729,,,,-1.3946073,,NO,,
AEVDISHSK,ph,S,7,true,"atm and atr DNA damage response",88,25561503,"MASCOT Score",35.0000000,0.9950000,,,,,0.1900000
AEVDISHSK,ph,S,7,true,"Tissue atlas Arabidopsis - ProteomicsDB",114,32188942,"MaxQuant score",186.7400000,0.9999830,,,,8.4868602812094E-8,
AEVDISHSKKK,ph,S,9,true,"SIRK1 phosphorylation",86a,23820729,"MaxQuant Score",98.7090000,1.0000000,,,,0.079000003635883,2.4260000
AEVDISHSKKK,ph,S,9,true,"SIRK1 exp - sirk1 mutant vs WT",86b,23820729,,,,-0.6937997,,NO,,
AEVDISHSKKK,ph,S,9,true,"SIRK1 exp - 35S:SIRK1 vs WT",86c,23820729,,,,-1.3946073,,NO,,
AEVDISHSK,ph,S,9,true,"atm and atr DNA damage response",88,25561503,"MASCOT Score",39.0000000,0.9110000,,,,,-0.1000000
AEVDISHSK,ph,S,9,true,"Tissue atlas Arabidopsis - ProteomicsDB",114,32188942,"MaxQuant score",145.0900000,0.9700970,,,,2.38384000113E-5,
TPISAGHSPL,nt,T,61,true,"Arabidopsis translation initiation landscape - NT",167b,35069635,,,,,,,,
TGHYTPISAGHSPLK,ph,T,61,true,"Phospho cell culture sucrose/TOR",109,30833711,,,0.7987840,,,,,
TGHYTPISAGHSPLK,ph,T,61,true,"Tissue atlas Arabidopsis - ProteomicsDB",114,32188942,"MaxQuant score",183.5300000,0.9999920,,,,1.5163899704729E-25,
TGHYTPISAGHSPLK,ph,S,64,true,"atm and atr DNA damage response",88,25561503,"MASCOT Score",27.0000000,0.9910000,,,,,-1.0700000
TGHYTPISAGHSPLK,ph,S,64,true,"Tissue atlas Arabidopsis - ProteomicsDB",114,32188942,"MaxQuant score",177.1200000,0.9999900,,,,1.8037800290303E-19,
TGHYTPISAGHSPLKRPLQEYIR,ph,S,68,true,"Tissue atlas Arabidopsis - ProteomicsDB",114,32188942,"MaxQuant score",207.7600000,1.0000000,,,,0,
TGHYTPISAGHSPLK,ph,S,68,true,"atm and atr DNA damage response",88,25561503,"MASCOT Score",32.0000000,1.0000000,,,,,-0.3100000
TGHYTPISAGHSPLK,ph,S,68,true,"TOR Kinase and ABA Receptor",100,29290610,XCorr,5.1230402,1.0000000,,,,1.3379999472818E-6,
TGHYTPISAGHSPLK,ph,S,68,true,"Phospho cell culture sucrose/TOR",109,30833711,,,0.9917670,,,,,
LVKSQQGAGK,ac,K,135,true,"Quantitative Acetylproteomics",101,29440448,,,,,,,,
DSAVNAICYGAK,acy,C,301,true,"Arabidopsis S-acylation atlas - Meristem",163a,35681017,,,,,,,,
LDKHGKPNEK,ac,K,391,true,"Quantitative Acetylproteomics",101,29440448,,,,,,,,
RKHDDSSDSPAPVTTK,ph,S,447,true,"Phospho cell culture sucrose/TOR",109,30833711,,,0.9999840,,,,,
KHDDSSDSPAPVTTK,ph,S,447,true,"LAXIC - mannitol vs control",84b,23660473,XCorr,3.7500000,0.9240000,,,,0.00041881398647092,
KHDDSSDSPAPVTTK,ph,S,447,true,"Tissue atlas Arabidopsis - ProteomicsDB",114,32188942,"MaxQuant score",266.3500000,1.0000000,,,,0,
KHDDSSDSPAPVTTK,ph,S,448,true,"Large-scale phosphorylation discovery",44,23111157,XCorr,3.7210000,,,,,,
KHDDSSDSPAPVTTK,ph,S,448,true,"atm and atr DNA damage response",88,25561503,"MASCOT Score",26.0000000,0.9980000,,,,,0.9000000
HDDSSDSPAPVTTK,ph,S,448,true,"atm and atr DNA damage response",88,25561503,"MASCOT Score",26.0000000,0.9130000,,,,,0.5200000
HDDSSDSPAPVTTK,ph,S,448,true,"Tissue atlas Arabidopsis - ProteomicsDB",114,32188942,"MaxQuant score",334.7900000,1.0000000,,,,0,
KHDDSSDSPAPVTTKK,ph,S,450,true,"SnRK2 protein kinase substrates",85,23776212,XCorr,2.3989656,0.9980000,,,,0.0066815698519349,
RKHDDSSDSPAPVTTK,ph,S,450,true,"TOR Kinase and ABA Receptor",100,29290610,XCorr,4.2332716,0.9977000,,,,2.2199999420991E-6,
KHDDSSDSPAPVTTK,ph,S,450,true,"STN8 phosphoproteome",38,21768351,"MASCOT Score",56.3900000,,,,,,0.6540270
KHDDSSDSPAPVTTK,ph,S,450,true,"Chloroplast kinase substrates",60,19376835,"MASCOT Score",40.8100000,,,,,,-0.2099400
KHDDSSDSPAPVTTK,ph,S,450,true,"LAXIC - mannitol vs control",84b,23660473,XCorr,3.7500000,0.9240000,,,,0.00041881398647092,
KHDDSSDSPAPVTTK,ph,S,450,true,"SnRK2 protein kinase substrates",85,23776212,XCorr,3.5747797,0.9970000,,,,0.001013690023683,
KHDDSSDSPAPVTTK,ph,S,450,true,"atm and atr DNA damage response",88,25561503,"MASCOT Score",51.0000000,1.0000000,,,,,1.0900000
KHDDSSDSPAPVTTK,ph,S,450,true,"Col-0 callus - FC Col-0 vs. Col-0 Xray",111a,31410901,,50.8200000,,-3.9653556,0.0000000,NO,,0.6315121
KHDDSSDSPAPVTTK,ph,S,450,true,"Col-0 X-ray callus - FC Col-0 vs. Col-0 Xray",111b,31410901,,50.8200000,,-3.9653556,0.0000000,NO,,0.6315121
KHDDSSDSPAPVTTK,ph,S,450,true,"atm callus - FC atm vs. atm Xray",111c,31410901,,50.8200000,,-2.8162577,0.0000000,NO,,0.6315121
KHDDSSDSPAPVTTK,ph,S,450,true,"atm-3 X-ray callus - FC atm vs. atm Xray",111d,31410901,,50.8200000,,-2.8162577,0.0000000,NO,,0.6315121
HDDSSDSPAPVTTK,ph,S,450,true,"Chloroplast kinase substrates",60,19376835,"MASCOT Score",53.1100000,,,,,,-0.7344960
HDDSSDSPAPVTTK,ph,S,450,true,"LAXIC - mannitol vs control",84b,23660473,XCorr,4.7800000,1.0000000,,,,2.4900001223231E-13,
HDDSSDSPAPVTTK,ph,S,450,true,"SnRK2 protein kinase substrates",85,23776212,XCorr,4.7945433,1.0000000,,,,1.8900899942387E-11,
HDDSSDSPAPVTTK,ph,S,450,true,"TOR Kinase and ABA Receptor",100,29290610,XCorr,5.8529367,0.9997000,,,,9.1149998660001E-10,
HDDSSDSPAPVTTK,ph,S,450,true,"Tissue atlas Arabidopsis - ProteomicsDB",114,32188942,"MaxQuant score",382.9500000,1.0000000,,,,0,
HDDSSDSPAPVTTK,ph,T,455,true,"Tissue atlas Arabidopsis - ProteomicsDB",114,32188942,"MaxQuant score",89.9170000,0.9105810,,,,0.00054545700550079,
DKEEEKEEEAGSEK,ph,S,494,true,"Tissue atlas Arabidopsis - ProteomicsDB",114,32188942,"MaxQuant score",198.7700000,1.0000000,,,,1.7956500524224E-32,
KEEVIEEVASPKSEK,ph,S,515,true,"Tissue atlas Arabidopsis - ProteomicsDB",114,32188942,"MaxQuant score",354.3900000,1.0000000,,,,0,
DKKEEVIEEVASPK,ph,S,515,true,"STN8 phosphoproteome",38,21768351,"MASCOT Score",46.9300000,,,,,,-0.4414680
DKKEEVIEEVASPK,ph,S,515,true,"Phosphoproteome ethylene-regulated time response",46,24043427,"MASCOT Score",36.6600000,,,,,,-22.8024000
DKKEEVIEEVASPK,ph,S,515,true,"Tyrosine phosphorylation in Arabidopsis",59,18463617,"MASCOT Score",42.0000000,,,,,,-1.1310871
DKKEEVIEEVASPK,ph,S,515,true,"Chloroplast kinase substrates",60,19376835,"MASCOT Score",42.2000000,,,,,,0.1290010
DKKEEVIEEVASPK,ph,S,515,true,"srk2dei ABA signaling phopshoproteomics",83,23572148,"MASCOT Score",71.0000000,,,,,,0.0004000
DKKEEVIEEVASPK,ph,S,515,true,"LAXIC - ABA stress",84a,23660473,XCorr,2.9600000,1.0000000,,,,0.13652999699116,
DKKEEVIEEVASPK,ph,S,515,true,"LAXIC - mannitol vs control",84b,23660473,XCorr,3.3100000,1.0000000,,,,0.00053614599164575,
DKKEEVIEEVASPK,ph,S,515,true,"SnRK2 protein kinase substrates",85,23776212,XCorr,4.3077760,1.0000000,,,,0.0089219296351075,
DKKEEVIEEVASPK,ph,S,515,true,"Touch-induced phosphorylation: 40s touch vs untouc",136,30291188,"MASCOT score",83.5100000,,-0.2778317,0.2336479,NO,,3.0376040
EEVIEEVASPKSEK,ph,S,515,true,"TOR Kinase and ABA Receptor",100,29290610,XCorr,2.4264147,1.0000000,,,,0.00096309999935329,
KEEVIEEVASPK,ph,S,515,true,"Arabidopsis root NAA phosphoproteome",18a,27643528,"MaxQuant Score",221.4700000,1.0000000,,,,1.3929999793032E-35,0.8530000
KEEVIEEVASPK,ph,S,515,true,"STN8 phosphoproteome",38,21768351,"MASCOT Score",81.3000000,,,,,,-2.3044400
KEEVIEEVASPK,ph,S,515,true,"Large-scale phosphorylation discovery",44,23111157,XCorr,2.9070000,,,,,,
KEEVIEEVASPK,ph,S,515,true,"Chloroplast kinase substrates",60,19376835,"MASCOT Score",76.3600000,,,,,,-0.5806530
KEEVIEEVASPK,ph,S,515,true,"srk2dei ABA signaling phopshoproteomics",83,23572148,"MASCOT Score",64.0000000,,,,,,-0.0004000
KEEVIEEVASPK,ph,S,515,true,"SnRK2 protein kinase substrates",85,23776212,XCorr,4.0933614,1.0000000,,,,0.0010399400489405,
KEEVIEEVASPK,ph,S,515,true,"atm and atr DNA damage response",88,25561503,"MASCOT Score",61.0000000,1.0000000,,,,,-1.2200000
KEEVIEEVASPK,ph,S,515,true,"TOR Kinase and ABA Receptor",100,29290610,XCorr,5.3213673,1.0000000,,,,4.5609999688168E-6,
KEEVIEEVASPK,ph,S,515,true,"Phospho cell culture sucrose/TOR",109,30833711,,,1.0000000,,,,,
KEEVIEEVASPK,ph,S,515,true,"Touch-induced phosphorylation: 40s touch vs untouc",136,30291188,"MASCOT score",81.6600000,,-0.0665900,0.3697345,NO,,4.8783464
EEVIEEVASPK,ph,S,515,true,"STN8 phosphoproteome",38,21768351,"MASCOT Score",76.7600000,,,,,,-0.2734490
EEVIEEVASPK,ph,S,515,true,"Large-scale phosphorylation discovery",44,23111157,XCorr,3.7650000,,,,,,
EEVIEEVASPK,ph,S,515,true,"Tyrosine phosphorylation in Arabidopsis",59,18463617,"MASCOT Score",56.0000000,,,,,,-0.3820923
EEVIEEVASPK,ph,S,515,true,"Chloroplast kinase substrates",60,19376835,"MASCOT Score",80.6600000,,,,,,-0.2734490
EEVIEEVASPK,ph,S,515,true,"srk2dei ABA signaling phopshoproteomics",83,23572148,"MASCOT Score",72.0000000,,,,,,0.0007000
EEVIEEVASPK,ph,S,515,true,"LAXIC - ABA stress",84a,23660473,XCorr,2.9700000,1.0000000,,,,0.036303400993347,
EEVIEEVASPK,ph,S,515,true,"LAXIC - mannitol vs control",84b,23660473,XCorr,3.0500000,1.0000000,,,,0.00060430500889197,
EEVIEEVASPK,ph,S,515,true,"SnRK2 protein kinase substrates",85,23776212,XCorr,3.0778677,1.0000000,,,,0.0023221999872476,
EEVIEEVASPK,ph,S,515,true,"atm and atr DNA damage response",88,25561503,"MASCOT Score",68.0000000,1.0000000,,,,,-0.8000000
EEVIEEVASPK,ph,S,515,true,"Brassinosteroid-Regulated Phosphorylation Dynamics",94,26187819,"MaxQuant Score",116.5800000,1.0000000,,,,0.0060000000521541,0.2190000
EEVIEEVASPK,ph,S,515,true,"TOR Kinase and ABA Receptor",100,29290610,XCorr,4.8493791,1.0000000,,,,1.1580000318645E-6,
EEVIEEVASPK,ph,S,515,true,"Lateral root-induction - NAA vs control",106,23328941,"MASCOT Score",34.0000000,,0.4157711,0.1019224,NO,,
EEVIEEVASPK,ph,S,515,true,"Touch-induced phosphorylation: 40s touch vs untouc",136,30291188,"MASCOT score",61.1900000,,0.0158835,0.9247384,NO,,6.8559857
KEEVIEEVASPKSEK,ph,S,518,true,"Tissue atlas Arabidopsis - ProteomicsDB",114,32188942,"MaxQuant score",319.4500000,1.0000000,,,,0,
EEVIEEVASPKSEK,ph,S,518,true,"TOR Kinase and ABA Receptor",100,29290610,XCorr,2.4264147,1.0000000,,,,0.00096309999935329,
SKDTEAAVDAEDESAAEKSEK,ph,S,539,true,"SnRK2 protein kinase substrates",85,23776212,XCorr,6.0431690,1.0000000,,,,4.1599699157746E-16,
SKDTEAAVDAEDESAAEKSEK,ph,S,539,true,"Tissue atlas Arabidopsis - ProteomicsDB",114,32188942,"MaxQuant score",441.0300000,1.0000000,,,,0,
DTEAAVDAEDESAAEKSEK,ph,S,539,true,"SnRK2 protein kinase substrates",85,23776212,XCorr,6.1991301,1.0000000,,,,6.3918400466153E-14,
SKDTEAAVDAEDESAAEK,ph,S,539,true,"Phosphorylation nuclei-enriched fractions",28,19245862,,,,,,,,
SKDTEAAVDAEDESAAEK,ph,S,539,true,"STN8 phosphoproteome",38,21768351,"MASCOT Score",120.4500000,,,,,,-1.5437600
SKDTEAAVDAEDESAAEK,ph,S,539,true,"Large-scale phosphorylation discovery",44,23111157,XCorr,3.4620000,,,,,,
SKDTEAAVDAEDESAAEK,ph,S,539,true,"Tyrosine phosphorylation in Arabidopsis",59,18463617,"MASCOT Score",92.0000000,,,,,,-1.0798127
SKDTEAAVDAEDESAAEK,ph,S,539,true,"Chloroplast kinase substrates",60,19376835,"MASCOT Score",108.8600000,,,,,,-1.0814600
SKDTEAAVDAEDESAAEK,ph,S,539,true,"srk2dei ABA signaling phopshoproteomics",83,23572148,"MASCOT Score",65.0000000,,,,,,-0.0016000
SKDTEAAVDAEDESAAEK,ph,S,539,true,"LAXIC - ABA stress",84a,23660473,XCorr,6.6800000,1.0000000,,,,1.5999999719227E-12,
SKDTEAAVDAEDESAAEK,ph,S,539,true,"LAXIC - mannitol vs control",84b,23660473,XCorr,6.3400000,1.0000000,,,,4.1800001273948E-16,
SKDTEAAVDAEDESAAEK,ph,S,539,true,"SnRK2 protein kinase substrates",85,23776212,XCorr,6.5445819,1.0000000,,,,9.1715401140391E-6,
SKDTEAAVDAEDESAAEK,ph,S,539,true,"atm and atr DNA damage response",88,25561503,"MASCOT Score",79.0000000,1.0000000,,,,,0.5200000
SKDTEAAVDAEDESAAEK,ph,S,539,true,"Phospho cell culture sucrose/TOR",109,30833711,,,1.0000000,,,,,
DTEAAVDAEDESAAEK,ph,S,539,true,"Arabidopsis root NAA phosphoproteome",18a,27643528,"MaxQuant Score",176.1000000,1.0000000,,,,2.4430000047377E-30,0.0920000
DTEAAVDAEDESAAEK,ph,S,539,true,"STN8 phosphoproteome",38,21768351,"MASCOT Score",105.7400000,,,,,,-1.5686500
DTEAAVDAEDESAAEK,ph,S,539,true,"Large-scale phosphorylation discovery",44,23111157,XCorr,2.3820000,,,,,,
DTEAAVDAEDESAAEK,ph,S,539,true,"Tyrosine phosphorylation in Arabidopsis",59,18463617,"MASCOT Score",95.0000000,,,,,,-1.0984851
DTEAAVDAEDESAAEK,ph,S,539,true,"Chloroplast kinase substrates",60,19376835,"MASCOT Score",109.0800000,,,,,,-0.9449730
DTEAAVDAEDESAAEK,ph,S,539,true,"srk2dei ABA signaling phopshoproteomics",83,23572148,"MASCOT Score",99.0000000,,,,,,0.0002000
DTEAAVDAEDESAAEK,ph,S,539,true,"LAXIC - ABA stress",84a,23660473,XCorr,4.8500000,1.0000000,,,,1.5800000197075E-9,
DTEAAVDAEDESAAEK,ph,S,539,true,"LAXIC - mannitol vs control",84b,23660473,XCorr,4.9800000,1.0000000,,,,1.8200000426009E-14,
DTEAAVDAEDESAAEK,ph,S,539,true,"SnRK2 protein kinase substrates",85,23776212,XCorr,3.8906446,1.0000000,,,,0.00037659800727852,
DTEAAVDAEDESAAEK,ph,S,539,true,"atm and atr DNA damage response",88,25561503,"MASCOT Score",106.0000000,1.0000000,,,,,1.3100000
DTEAAVDAEDESAAEK,ph,S,539,true,"TOR Kinase and ABA Receptor",100,29290610,XCorr,5.8499780,1.0000000,,,,8.3520003413273E-11,
DTEAAVDAEDESAAEK,ph,S,539,true,"Lateral root-induction - NAA vs control",106,23328941,"MASCOT Score",62.0000000,,,,,,
SKDTEAAVDAEDESAAEKSEK,ph,S,544,true,"Tissue atlas Arabidopsis - ProteomicsDB",114,32188942,"MaxQuant score",368.7600000,1.0000000,,,,0,
DTEAAVDAEDESAAEKSEKK,ph,S,544,true,"TOR Kinase and ABA Receptor",100,29290610,XCorr,3.2494512,0.9758000,,,,0.042679999023676,
KNKDSEDDEE,ph,S,560,true,"SnRK2 protein kinase substrates",85,23776212,XCorr,3.0428383,1.0000000,,,,0.062041100114584,
NKDSEDDEE,ph,S,560,true,"SnRK2 protein kinase substrates",85,23776212,XCorr,2.4171741,1.0000000,,,,0.0066665699705482,
NKDSEDDEE,ph,S,560,true,"atm and atr DNA damage response",88,25561503,"MASCOT Score",45.0000000,1.0000000,,,,,-0.8800000
