Peptide,PTM,ModifiedAA,ModifiedPosition,PeptideUniqueToGene,ExperimentDesc,ExpID,PubmedID,ScoreType,IdentScore,LocProb,Log2FChange,PQ-val,QuantSig,PEP,MassErrorPPM
GIVEQAKSQSLNR,ph,S,13,true,"atm and atr DNA damage response",88,25561503,"MASCOT Score",25.0000000,1.0000000,,,,,-1.9400000
GIVEQAKSQSLNR,ph,S,13,true,"Tissue atlas Arabidopsis - ProteomicsDB",114,32188942,"MaxQuant score",120.9200000,1.0000000,,,,0.00012080300075468,
GIVEQAKSQSLNR,ph,S,15,true,"atm and atr DNA damage response",88,25561503,"MASCOT Score",25.0000000,1.0000000,,,,,-1.9400000
GIVEQAKSQSLNR,ph,S,15,true,"Tissue atlas Arabidopsis - ProteomicsDB",114,32188942,"MaxQuant score",85.4730000,1.0000000,,,,0.00041695300024003,
QSSLYSLTLDEVQNHLGSSGK,ph,S,21,true,"ABA-induced protein phosphorylation",35,20733066,,,,,,,,
QSSLYSLTLDEVQNHLGSSGK,ph,S,21,true,"srk2dei ABA signaling phopshoproteomics",83,23572148,"MASCOT Score",53.0000000,,,,,,0.0028000
QSSLYSLTLDEVQNHLGSSGK,ph,S,21,true,"TOR Kinase and ABA Receptor",100,29290610,XCorr,3.2532833,0.8970000,,,,6.6460000880397E-7,
QSSLYSLTLDEVQNHLGSSGK,ph,S,21,true,"Col-0 callus - FC Col-0 vs. Col-0 Xray",111a,31410901,,33.0700000,,-2.7618945,0.0000000,NO,,0.8957141
QSSLYSLTLDEVQNHLGSSGK,ph,S,21,true,"Col-0 X-ray callus - FC Col-0 vs. Col-0 Xray",111b,31410901,,33.0700000,,-2.7618945,0.0000000,NO,,0.8957141
QSSLYSLTLDEVQNHLGSSGK,ph,S,21,true,"atm callus - FC atm vs. atm Xray",111c,31410901,,33.0700000,,-0.5179701,0.0000000,NO,,0.8957141
QSSLYSLTLDEVQNHLGSSGK,ph,S,21,true,"atm-3 X-ray callus - FC atm vs. atm Xray",111d,31410901,,33.0700000,,-0.5179701,0.0000000,NO,,0.8957141
ALGSMNLDELLK,ph,S,43,true,"Phytohormone-responsive phosphoproteins",34,20374526,"MASCOT Score",61.0000000,,,,,,
ALGSMNLDELLK,ph,S,43,true,"Phosphoproteome ethylene-regulated time response",46,24043427,"MASCOT Score",73.9500000,,,,,,-11.9620000
ALGSMNLDELLK,ph,S,43,true,"Chloroplast kinase substrates",60,19376835,"MASCOT Score",50.6300000,,,,,,-1.5445400
ALGSMNLDELLK,ph,S,43,true,"srk2dei ABA signaling phopshoproteomics",83,23572148,"MASCOT Score",47.0000000,,,,,,0.0002000
ALGSMNLDELLK,ph,S,43,true,"LAXIC - ABA stress",84a,23660473,XCorr,3.0800000,1.0000000,,,,2.5699999241624E-5,
ALGSMNLDELLK,ph,S,43,true,"LAXIC - mannitol vs control",84b,23660473,XCorr,2.9400000,1.0000000,,,,4.1200000850949E-6,
ALGSMNLDELLK,ph,S,43,true,"SnRK2 protein kinase substrates",85,23776212,XCorr,3.8371789,1.0000000,,,,0.0010049500269815,
ALGSMNLDELLK,ph,S,43,true,"atm and atr DNA damage response",88,25561503,"MASCOT Score",55.0000000,1.0000000,,,,,-1.4400000
ALGSMNLDELLK,ph,S,43,true,"Protein sumoylation and phosphorylation cross-talk",97,28419593,,,,,,,,
ALGSMNLDELLK,ph,S,43,true,"TOR Kinase and ABA Receptor",100,29290610,XCorr,3.9049838,1.0000000,,,,1.8500000805943E-5,
ALGSMNLDELLK,ph,S,43,true,"Phospho cell culture sucrose/TOR",109,30833711,,,1.0000000,,,,,
ALGSMNLDELLK,ph,S,43,true,"Col-0 callus - FC Col-0 vs. Col-0 Xray",111a,31410901,,31.4300000,,-0.8399745,0.0000000,NO,,0.1403073
ALGSMNLDELLK,ph,S,43,true,"Col-0 X-ray callus - FC Col-0 vs. Col-0 Xray",111b,31410901,,31.4300000,,-0.8399745,0.0000000,NO,,0.1403073
ALGSMNLDELLK,ph,S,43,true,"atm callus - FC atm vs. atm Xray",111c,31410901,,31.4300000,,-1.1377052,0.0000000,NO,,0.1403073
ALGSMNLDELLK,ph,S,43,true,"atm-3 X-ray callus - FC atm vs. atm Xray",111d,31410901,,31.4300000,,-1.1377052,0.0000000,NO,,0.1403073
ALGSMNLDELLK,ph,S,43,true,"Tissue atlas Arabidopsis - ProteomicsDB",114,32188942,"MaxQuant score",200.9700000,1.0000000,,,,1.1272700308687E-25,
ALGSMNLDELLK,ph,S,43,true,"Touch-induced phosphorylation: 40s touch vs untouc",136,30291188,"MASCOT score",81.0800000,,0.1851467,0.4214960,NO,,7.4724989
QGSLTLPR,ph,S,81,false,"ABA-induced protein phosphorylation",35,20733066,,,,,,,,
QGSLTLPR,ph,S,81,false,"Phosphoproteome ethylene-regulated time response",46,24043427,"MASCOT Score",47.2500000,,,,,,-22.9304000
QGSLTLPR,ph,S,81,false,"srk2dei ABA signaling phopshoproteomics",83,23572148,"MASCOT Score",49.0000000,,,,,,-0.0005000
QGSLTLPR,ph,S,81,false,"LAXIC - ABA stress",84a,23660473,XCorr,2.1200000,0.9950000,,,,0.004308819770813,
QGSLTLPR,ph,S,81,false,"LAXIC - mannitol vs control",84b,23660473,XCorr,2.3400000,0.9350000,,,,0.001663270057179,
QGSLTLPR,ph,S,81,false,"atm and atr DNA damage response",88,25561503,"MASCOT Score",47.0000000,0.9960000,,,,,-0.7700000
QGSLTLPR,ph,S,81,false,"TOR Kinase and ABA Receptor",100,29290610,XCorr,2.7452154,0.9101000,,,,0.0026700000744313,
QGSLTLPR,ph,S,81,false,"Col-0 callus - FC Col-0 vs. Col-0 Xray",111a,31410901,,29.4800000,,-0.7236115,0.0000000,NO,,0.1178629
QGSLTLPR,ph,S,81,false,"Col-0 X-ray callus - FC Col-0 vs. Col-0 Xray",111b,31410901,,29.4800000,,-0.7236115,0.0000000,NO,,0.1178629
QGSLTLPR,ph,S,81,false,"atm callus - FC atm vs. atm Xray",111c,31410901,,29.4800000,,-0.0335836,0.0000000,NO,,0.1178629
QGSLTLPR,ph,S,81,false,"atm-3 X-ray callus - FC atm vs. atm Xray",111d,31410901,,29.4800000,,-0.0335836,0.0000000,NO,,0.1178629
QGSLTLPR,ph,S,81,false,"Tissue atlas Arabidopsis - ProteomicsDB",114,32188942,"MaxQuant score",183.2200000,1.0000000,,,,9.4484503279091E-6,
QGSLTLPR,ph,T,83,false,"Tyrosine phosphorylation in Arabidopsis",59,18463617,"MASCOT Score",22.0000000,,,,,,-1.6834006
QGSLTLPR,ph,T,83,false,"srk2dei ABA signaling phopshoproteomics",83,23572148,"MASCOT Score",26.0000000,,,,,,0.0005000
QGSLTLPR,ph,T,83,false,"SnRK2 protein kinase substrates",85,23776212,XCorr,2.2104070,0.9990000,,,,0.0014614500105381,
DKQPTLGEMTLEDLLLK,ph,T,118,true,"Phosphoproteome ethylene-regulated time response",46,24043427,"MASCOT Score",36.0300000,,,,,,5.6995000
DKQPTLGEMTLEDLLLK,ph,T,118,true,"SnRK2 protein kinase substrates",85,23776212,XCorr,3.8994813,1.0000000,,,,0.000311198993586,
DKQPTLGEMTLEDLLLK,ph,T,118,true,"TOR Kinase and ABA Receptor",100,29290610,XCorr,5.3551822,1.0000000,,,,1.4310000406859E-10,
DKQPTLGEMTLEDLLLK,ph,T,118,true,"Tissue atlas Arabidopsis - ProteomicsDB",114,32188942,"MaxQuant score",226.9500000,1.0000000,,,,0,
QPTLGEMTLEDLLLK,ph,T,118,true,"TOR Kinase and ABA Receptor",100,29290610,XCorr,3.5791178,1.0000000,,,,5.2919999689038E-6,
RVASGEVVEK,ph,S,217,true,"TOR Kinase and ABA Receptor",100,29290610,XCorr,3.1215489,1.0000000,,,,0.026340000331402,
VASGEVVEK,ph,S,217,true,"STN8 phosphoproteome",38,21768351,"MASCOT Score",42.2700000,,,,,,1.1273500
VASGEVVEK,ph,S,217,true,"atm and atr DNA damage response",88,25561503,"MASCOT Score",49.0000000,1.0000000,,,,,-0.8500000
VASGEVVEK,ph,S,217,true,"Tissue atlas Arabidopsis - ProteomicsDB",114,32188942,"MaxQuant score",133.4200000,1.0000000,,,,0.00010855100117624,
VASGEVVEKTVER,ub,K,223,true,"Arabidopsis ubiquitination COFRADIC",40,26744219,"MaxQuant Score",84.2970000,1.0000000,,,,3.4969998523593E-5,0.8190000
