Peptide,PTM,ModifiedAA,ModifiedPosition,PeptideUniqueToGene,ExperimentDesc,ExpID,PubmedID,ScoreType,IdentScore,LocProb,Log2FChange,PQ-val,QuantSig,PEP,MassErrorPPM
SLSAEVESPEDGSRTPMR,ph,S,81,true,"atm and atr DNA damage response",88,25561503,"MASCOT Score",26.0000000,1.0000000,,,,,-0.0200000
SLSAEVESPEDGSR,ph,S,81,true,"Tissue atlas Arabidopsis - ProteomicsDB",114,32188942,"MaxQuant score",189.1000000,0.9938280,,,,6.1774900738343E-24,
SLSAEVESPEDGSRTPMR,ph,S,86,true,"atm and atr DNA damage response",88,25561503,"MASCOT Score",26.0000000,0.9840000,,,,,-0.0200000
SLSAEVESPEDGSRTPMR,ph,T,88,true,"TOR Kinase and ABA Receptor",100,29290610,XCorr,3.0279777,0.8172000,,,,0.0078149996697903,
RTDDFSETGDSDVFTSER,ph,S,134,true,"Tissue atlas Arabidopsis - ProteomicsDB",114,32188942,"MaxQuant score",52.9260000,0.7651330,,,,0.00046911698882468,
EGWFQESSVASPTRFPGETSDGK,ph,S,229,true,"srk2dei ABA signaling phopshoproteomics",83,23572148,"MASCOT Score",46.0000000,,,,,,0.0006000
EGWFQESSVASPTRFPGETSDGK,ph,S,229,true,"TOR Kinase and ABA Receptor",100,29290610,XCorr,3.4900460,0.8080000,,,,0.020109999924898,
EGWFQESSVASPTRFPGETSDGK,ph,S,229,true,"Tissue atlas Arabidopsis - ProteomicsDB",114,32188942,"MaxQuant score",187.7500000,0.9244660,,,,0,
SSQSQLHDLQYHNLYEPSR,ph,S,247,true,"Tissue atlas Arabidopsis - ProteomicsDB",114,32188942,"MaxQuant score",121.9400000,0.8987100,,,,1.3998899754986E-15,
SSQSQLHDLQYHNLYEPSR,ph,S,249,true,"Tissue atlas Arabidopsis - ProteomicsDB",114,32188942,"MaxQuant score",107.6500000,0.9119710,,,,1.4267799441914E-10,
RLSEQQPTSSETIGETSK,ph,S,485,true,"Tissue atlas Arabidopsis - ProteomicsDB",114,32188942,"MaxQuant score",41.0840000,0.9941570,,,,0.0031067999079823,
SVSHSEELLYKK,ph,S,573,true,"Tissue atlas Arabidopsis - ProteomicsDB",114,32188942,"MaxQuant score",134.0600000,0.9946820,,,,2.1971200112603E-6,
SVSHSEELLYK,ph,S,573,true,"atm and atr DNA damage response",88,25561503,"MASCOT Score",32.0000000,0.9990000,,,,,-1.4200000
SVSHSEELLYKK,ph,S,577,true,"Tissue atlas Arabidopsis - ProteomicsDB",114,32188942,"MaxQuant score",165.7200000,0.9999770,,,,2.555890048217E-11,
SVSHSEELLYK,ph,S,577,true,"atm and atr DNA damage response",88,25561503,"MASCOT Score",32.0000000,0.9990000,,,,,-1.4200000
SATTHSPLNSLVNENQR,ph,S,678,true,"atm and atr DNA damage response",88,25561503,"MASCOT Score",40.0000000,0.9900000,,,,,0.6600000
SATTHSPLNSLVNENQR,ph,S,678,true,"Tissue atlas Arabidopsis - ProteomicsDB",114,32188942,"MaxQuant score",84.1590000,0.9635450,,,,8.4565297584049E-5,
SITSSRDSFNDHENLK,ph,S,1063,true,"Tissue atlas Arabidopsis - ProteomicsDB",114,32188942,"MaxQuant score",90.8220000,0.8524030,,,,2.725689955696E-5,
LPEYELGEMLESDNDVDER,ph,S,1143,true,"SnRK2 protein kinase substrates",85,23776212,XCorr,4.4536366,1.0000000,,,,1.5494599381327E-7,
GSFNDHEIPR,ph,S,1158,true,"Tissue atlas Arabidopsis - ProteomicsDB",114,32188942,"MaxQuant score",68.5150000,1.0000000,,,,0.0072031300514936,
QGDAEKDSDVFSEGHEFPSK,ph,S,1359,true,"SnRK2 protein kinase substrates",85,23776212,XCorr,2.6476991,0.9930000,,,,3.96250006599E-16,
DSDVFSEGHEFPSK,ph,S,1359,true,"STN8 phosphoproteome",38,21768351,"MASCOT Score",49.9200000,,,,,,-0.9571050
DSDVFSEGHEFPSK,ph,S,1359,true,"Chloroplast kinase substrates",60,19376835,"MASCOT Score",50.3200000,,,,,,-0.9571050
DSDVFSEGHEFPSK,ph,S,1359,true,"srk2dei ABA signaling phopshoproteomics",83,23572148,"MASCOT Score",23.0000000,,,,,,-0.0005000
DSDVFSEGHEFPSK,ph,S,1359,true,"SnRK2 protein kinase substrates",85,23776212,XCorr,2.7405877,1.0000000,,,,0.037023600190878,
DSDVFSEGHEFPSK,ph,S,1359,true,"atm and atr DNA damage response",88,25561503,"MASCOT Score",46.0000000,1.0000000,,,,,-0.7600000
DSDVFSEGHEFPSK,ph,S,1359,true,"TOR Kinase and ABA Receptor",100,29290610,XCorr,4.1319098,1.0000000,,,,0.010979999788105,
DSDVFSEGHEFPSK,ph,S,1359,true,"Tissue atlas Arabidopsis - ProteomicsDB",114,32188942,"MaxQuant score",290.6900000,1.0000000,,,,0,
MAELDSDTEEEIVEEQLEHLQK,ph,S,1373,true,"srk2dei ABA signaling phopshoproteomics",83,23572148,"MASCOT Score",56.0000000,,,,,,0.0000000
MAELDSDTEEEIVEEQLEHLQK,ph,S,1373,true,"SnRK2 protein kinase substrates",85,23776212,XCorr,4.4117618,1.0000000,,,,5.362560173694E-9,
MAELDSDTEEEIVEEQLEHLQK,ph,S,1373,true,"Brassinosteroid-Regulated Phosphorylation Dynamics",94,26187819,"MaxQuant Score",76.9090000,1.0000000,,,,0.028999999165535,1.9060000
MAELDSDTEEEIVEEQLEHLQK,ph,S,1373,true,"TOR Kinase and ABA Receptor",100,29290610,XCorr,5.4408560,1.0000000,,,,4.1229998970493E-8,
MAELDSDTEEEIVEEQLEHLQK,ph,T,1375,true,"srk2dei ABA signaling phopshoproteomics",83,23572148,"MASCOT Score",56.0000000,,,,,,0.0000000
MAELDSDTEEEIVEEQLEHLQK,ph,T,1375,true,"SnRK2 protein kinase substrates",85,23776212,XCorr,4.4117618,1.0000000,,,,5.362560173694E-9,
MAELDSDTEEEIVEEQLEHLQK,ph,T,1375,true,"Brassinosteroid-Regulated Phosphorylation Dynamics",94,26187819,"MaxQuant Score",76.9090000,1.0000000,,,,0.028999999165535,1.9060000
MAELDSDTEEEIVEEQLEHLQK,ph,T,1375,true,"TOR Kinase and ABA Receptor",100,29290610,XCorr,5.4408560,1.0000000,,,,4.1229998970493E-8,
QHDHIYSTTEPSE,nt,Q,1400,true,"HUNTER N-terminome: legumain, GluC and trypsin",119,31951383,"MaxQuant score",126.6700000,,,,,,
SPIASTMHSHIVSPLR,ph,S,1454,true,"Tissue atlas Arabidopsis - ProteomicsDB",114,32188942,"MaxQuant score",68.4900000,0.9998710,,,,0.00016541799413972,
SPIASTMHSHIVSPLR,ph,S,1466,true,"atm and atr DNA damage response",88,25561503,"MASCOT Score",65.0000000,1.0000000,,,,,-0.1700000
SPIASTMHSHIVSPLR,ph,S,1466,true,"Tissue atlas Arabidopsis - ProteomicsDB",114,32188942,"MaxQuant score",147.1700000,0.9999250,,,,1.6142000236474E-10,
