Peptide,PTM,ModifiedAA,ModifiedPosition,PeptideUniqueToGene,ExperimentDesc,ExpID,PubmedID,ScoreType,IdentScore,LocProb,Log2FChange,PQ-val,QuantSig,PEP,MassErrorPPM
DVSALKNDNSTGGIK,ng,N,370,true,"Conserved N-glycosylation",74,22633491,"MaxQuant Score",158.0400000,0.9960000,,,,1.6090000437458E-37,0.1800000
LENNLLEGNIPSSIKNCSSLR,ng,N,470,true,"Conserved N-glycosylation",74,22633491,"MaxQuant Score",133.8800000,1.0000000,,,,5.3439999435021E-21,-0.0730000
SCPAISPKPIVLNPNATFDPYNGEIVPPGAGHK,ng,N,578,true,"Conserved N-glycosylation",74,22633491,"MaxQuant Score",105.2300000,0.9680000,,,,0.0020000000949949,-0.1920000
SAVPLTFSGGDDFSR,ph,S,643,true,"Tissue atlas Arabidopsis - ProteomicsDB",114,32188942,"MaxQuant score",76.2590000,0.9647250,,,,1.8301300475088E-9,
SAVPLTFSGGDDFSR,ph,S,649,true,"Tissue atlas Arabidopsis - ProteomicsDB",114,32188942,"MaxQuant score",140.1700000,0.9963740,,,,6.9200299194562E-36,
LVMFSGEPDFSTGTHALLNK,ph,S,665,true,"Tissue atlas Arabidopsis - ProteomicsDB",114,32188942,"MaxQuant score",153.1000000,1.0000000,,,,1.5440699903014E-25,
LVMFSGEPDFSTGTHALLNK,ph,S,671,true,"TOR Kinase and ABA Receptor",100,29290610,XCorr,3.4146130,0.8749000,,,,0.00019940000493079,
LVMFSGEPDFSTGTHALLNK,ph,S,671,true,"Tissue atlas Arabidopsis - ProteomicsDB",114,32188942,"MaxQuant score",188.9800000,0.8371280,,,,4.2038953929745E-45,
LTVSSLVKSQDEFER,ub,K,715,true,"upl3 mutant / wildtype",168,35926874,"MaxQuant score",101.7500000,1.0000000,2.0999684,,,9.8995002417723E-8,0.8152400
CPSGSSDELGSS,ph,S,958,true,"atm and atr DNA damage response",88,25561503,"MASCOT Score",31.0000000,0.9950000,,,,,-0.3700000
