Peptide,PTM,ModifiedAA,ModifiedPosition,PeptideUniqueToGene,ExperimentDesc,ExpID,PubmedID,ScoreType,IdentScore,LocProb,Log2FChange,PQ-val,QuantSig,PEP,MassErrorPPM
LNNGLAR,nt,L,65,true,"Arabidopsis translation initiation landscape - NT",167b,35069635,,,,,,,,
YPPMRDALNATGR,ng,N,214,true,"Conserved N-glycosylation",74,22633491,"MaxQuant Score",140.4300000,1.0000000,,,,0.003000000026077,0.2440000
DALNATGR,ng,N,214,true,"N-glycan occupancy Arabidopsis glycoproteins",87,23994444,"Ladder score",57.8000000,,,,,,
TTDDINDTWASMTTIADLNNK,ng,N,250,true,"Conserved N-glycosylation",74,22633491,"MaxQuant Score",197.2200000,1.0000000,,,,0,-0.1360000
TTDDINDTWASMTTIADLNNK,ng,N,250,true,"N-linked Glycan Micro-heterogeneity Arabidopsis",134,29237727,,,,,,,,
TTDDINDTWASMTTIADLNNK,ng,N,250,true,"UDP-GlcNAc transporter glycopeptide analysis",135,30224661,,,,,,,1.1870635030498E-10,0.8000000
TTDDINDTWASMTTIADLNNK,ng,N,250,true,"Open search Plant PTM Viewer 2.0 - N-glycosylation",164a,TBA,,,,,,,,
APLLIGCDVR,ox,C,311,true,"OxiTRAQ Arabidopsis - 5 mM H2O2 versus control",47,24376095,,,,-0.4063010,0.0245944,NO,,
APLLIGCDVR,sno,C,311,true,"Endogenous S-nitrosylation in Arabidopsis",64,22115780,"MASCOT Score",38.0000000,,,,,,
APLLIGCDVR,sno,C,311,true,"hot5-4 / wildtype, FAT-switch S-nitrosoproteome",169,37277371,,,,-0.3460227,0.1583464,NO,,
NMTAETLEILSNK,ng,N,315,true,"Conserved N-glycosylation",74,22633491,"MaxQuant Score",167.6300000,1.0000000,,,,1.4300000328747E-23,2.0980000
NMTAETLEILSNK,ng,N,315,true,"N-glycan occupancy Arabidopsis glycoproteins",87,23994444,"Ladder score",66.7000000,,,,,,
NMTAETLEILSNK,ng,N,315,true,"UDP-GlcNAc transporter glycopeptide analysis",135,30224661,,,,,,,0.00080350536154583,0.3000000
IQANGENDCQQVWSGPLSGDR,sno,C,352,true,"hot5-4 / wildtype, FAT-switch S-nitrosoproteome",169,37277371,,,,,,,,
