Peptide,PTM,ModifiedAA,ModifiedPosition,PeptideUniqueToGene,ExperimentDesc,ExpID,PubmedID,ScoreType,IdentScore,LocProb,Log2FChange,PQ-val,QuantSig,PEP,MassErrorPPM
SEKDAELLYEAR,ub,K,74,true,"Arabidopsis ubiquitination COFRADIC",40,26744219,"MaxQuant Score",50.0880000,1.0000000,,,,0.0060000000521541,0.1690000
KMTQEQYGALR,ub,K,91,true,"Arabidopsis ubiquitination COFRADIC",40,26744219,"MaxQuant Score",124.6700000,1.0000000,,,,3.7349998649461E-9,-0.1110000
KMTQEQYGALR,ph,T,93,true,"atm and atr DNA damage response",88,25561503,"MASCOT Score",45.0000000,1.0000000,,,,,-0.7400000
KMTQEQYGALR,ph,T,93,true,"TOR Kinase and ABA Receptor",100,29290610,XCorr,3.0656641,1.0000000,,,,0.00025429998640902,
KIGGTYKDFFK,ph,T,107,true,"Tissue atlas Arabidopsis - ProteomicsDB",114,32188942,"MaxQuant score",112.0200000,1.0000000,,,,2.0604700694093E-5,
IGGTYKDFFK,ph,T,107,true,"atm and atr DNA damage response",88,25561503,"MASCOT Score",25.0000000,0.9420000,,,,,-0.1300000
YAHVSCLQNPPSGNFFTR,ox,C,157,true,"SPEAR - 10 mM H2O2 / mock",138a,34619326,,,,2.5705385,0.0066003,YES,,
YAHVSCLQNPPSGNFFTR,ox,C,157,true,"SPEAR - 50 mM H2O2 / mock",138b,34619326,,,,2.5188670,0.0077149,YES,,
