Peptide,PTM,ModifiedAA,ModifiedPosition,PeptideUniqueToGene,ExperimentDesc,ExpID,PubmedID,ScoreType,IdentScore,LocProb,Log2FChange,PQ-val,QuantSig,PEP,MassErrorPPM
AKAAKSSTTTISDGSSDASVSDGKKTVR,nt,A,57,true,"Arg/N-end rule pathway Roots",80,25728785,"MASCOT Score",40.8100000,,,,,0.010560000315309,
AKAAKSSTTTISDGSSDASVSDGKKTVR,nt,A,57,true,"HUNTER N-terminome: legumain, GluC and trypsin",119,31951383,"MaxQuant score",40.4280000,,,,,,
AKAAKSSTTTISDGSSDASVSD,nt,A,57,true,"HUNTER N-terminome: legumain, GluC and trypsin",119,31951383,"MaxQuant score",80.7520000,,,,,,
KAAKSSTTTISDGSSDASVSDGKKTVR,nt,K,58,true,"Arg/N-end rule pathway Roots",80,25728785,"MASCOT Score",24.9700000,,,,,0.0011289999820292,
KAAKSSTTTISDGSSDASVSDGKKTVR,nta,K,58,true,"HUNTER N-terminome: legumain, GluC and trypsin",119,31951383,"MaxQuant score",87.7200000,,,,,,
KAAKSSTTTISDGSSDASVSD,nta,K,58,true,"HUNTER N-terminome: legumain, GluC and trypsin",119,31951383,"MaxQuant score",,,,,,,
AAKSSTTTISDGSSDASVSDGKKTVR,nt,A,59,true,"Metacaspase9 substrates - in vitro rMC9",51c,23964026,"MASCOT Score",47.0000000,,1.5571662,,NO,,-1.2624969
AAKSSTTTISDGSSDASVSDGKKTVR,nt,A,59,true,"Arg/N-end rule pathway Roots",80,25728785,"MASCOT Score",40.9300000,,,,,3.5960001696367E-5,
AAKSSTTTISDGSSDASVSDGKKTVR,nt,A,59,true,"Stromal N-terminome",96,26371235,"MASCOT Score",39.5800000,,,,,,
AAKSSTTTISDGSSDASVSDGKKTVR,nt,A,59,true,"FtsH12 N-terminome: WT / FtsH12 knockdown miRNA",118,33216923,"MaxQuant score",172.1000000,,,,,0,
AAKSSTTTISDGSSDASVSDGKKTVR,nt,A,59,true,"HUNTER N-terminome: legumain, GluC and trypsin",119,31951383,"MaxQuant score",158.0500000,,,,,,
AAKSSTTTISDGSSDASVSD,nt,A,59,true,"HUNTER N-terminome: legumain, GluC and trypsin",119,31951383,"MaxQuant score",150.1100000,,,,,,
AAKSSTTTISDGSSDASVSD,nt,A,59,true,"Arabidopsis translation initiation landscape - NT",167b,35069635,,,,,,,,
AKSSTTTISDGSSDASVSDGKKTVR,nt,A,60,true,"Arg/N-end rule pathway Roots",80,25728785,"MASCOT Score",47.5100000,,,,,1.8410000848235E-5,
AKSSTTTISDGSSDASVSDGKKTVR,nt,A,60,true,"Stromal N-terminome",96,26371235,"MASCOT Score",36.5300000,,,,,,
AKSSTTTISDGSSDASVSDGKKTVR,nt,A,60,true,"HUNTER N-terminome: legumain, GluC and trypsin",119,31951383,"MaxQuant score",58.6270000,,,,,,
VGDFEMNLK,mox,M,117,true,"cat2 Methionine oxidation - 1h stress",62a,25693801,"MASCOT Score",37.0000000,,-0.0270178,,NO,,
VGDFEMNLKR,ac,K,120,true,"Quantitative Acetylproteomics",101,29440448,,,,,,,,
SASSAPSPSQAKPSSEK,ph,S,157,true,"Tissue atlas Arabidopsis - ProteomicsDB",114,32188942,"MaxQuant score",51.1270000,0.8103850,,,,0.0061898399144411,
QSPSCK,so,C,219,true,"Arabidopsis S-sulfenylation chemoproteomics",108,31578252,"pFind PSM Score",0.3405420,,1.1494300,,,,-1.5382788
QSPSCK,so,C,219,true,"S-sulfenylation site detection using YAP1C",110,32714340,,,,,,,,
