Peptide,PTM,ModifiedAA,ModifiedPosition,PeptideUniqueToGene,ExperimentDesc,ExpID,PubmedID,ScoreType,IdentScore,LocProb,Log2FChange,PQ-val,QuantSig,PEP,MassErrorPPM
ANPKVFFDIL,nt,A,2,true,"N-term acetylation drought responses",5,26184543,,,,,,,,
ANPKVFFDILIGKMKAGR,nta,A,2,true,"Arg/N-end rule pathway Roots",80,25728785,"MASCOT Score",44.9600000,,,,,2.9340000764932E-5,
ANPKVFFDILIGKMKAGR,nta,A,2,true,"HUNTER N-terminome: legumain, GluC and trypsin",119,31951383,"MaxQuant score",64.5070000,,,,,,
ANPKVFFDILIGKMKAGR,nta,A,2,true,"Mitochondrial intermediate peptidases - icp55 / WT",131a,25732537,,74.3800000,,-0.3365331,,,,
ANPKVFFDILIGKMKAGR,nta,A,2,true,"Mitochondrial intermediate peptidases - oct1-1 / WT",131b,25732537,,71.4700000,,2.9528893,,,,
ANPKVFFDILIGKMKAGR,nta,A,2,true,"Mitochondrial intermediate peptidases - oct1-2 / WT",131c,25732537,,68.0300000,,-0.4277877,,,,
ANPKVFFDIL,nta,A,2,true,"N-term acetylation drought responses",5,26184543,,,,,,,,
ANPKVFFD,nta,A,2,false,"HUNTER N-terminome: legumain, GluC and trypsin",119,31951383,"MaxQuant score",,,,,,,
ANPKVFFD,nta,A,2,false,"Arabidopsis translation initiation landscape - NTA",167a,35069635,,,,,,,,
ALCTGENGIGK,ox,C,40,true,"OxiTRAQ Arabidopsis - 5 mM H2O2 versus control",47,24376095,,,,0.9237100,0.0042298,YES,,
ALCTGENGIGK,so,C,40,true,"S-sulfenylation site detection using YAP1C",110,32714340,,,,,,,,
IIPGFMCQGGDFTR,ox,C,69,true,"Redox kickstart of mitochondria",112,31871212,,,,-1.9093231,0.0015797,YES,,
FEDENFKLK,ac,K,96,true,"Quantitative Acetylproteomics",101,29440448,,,,,,,,
SMANSGPNTNGSQFF,nt,S,106,false,"Arabidopsis translation initiation landscape - NT",167b,35069635,,,,,,,,
GSQFFICTE,nt,G,116,false,"Arg/N-end rule seed, prt6 vs. Wt",99,29168982,"MASCOT Score",39.2100000,,-0.2897277,0.5137449,NO,0.0073910001665354,-1.7648948
VVIEDCGELKNPSS,ox,C,168,true,"OxiTRAQ Arabidopsis - 5 mM H2O2 versus control",47,24376095,,,,0.9409139,0.0084924,YES,,
VVIEDCGELKNPSS,ox,C,168,true,"SPEAR - 10 mM H2O2 / mock",138a,34619326,,,,-3.4223802,0.0093207,YES,,
VVIEDCGELK,ox,C,168,true,"Redox kickstart of mitochondria",112,31871212,,,,-1.2149689,0.0121854,YES,,
VVIEDCGELKNPSS,so,C,168,true,"S-sulfenylation site detection using YAP1C",110,32714340,,,,,,,,
VVIEDCGELKNPSS,ub,K,172,true,"Arabidopsis ubiquitination COFRADIC",40,26744219,"MaxQuant Score",78.8140000,1.0000000,,,,0.00022079999325797,-0.0880000
