Peptide,PTM,ModifiedAA,ModifiedPosition,PeptideUniqueToGene,ExperimentDesc,ExpID,PubmedID,ScoreType,IdentScore,LocProb,Log2FChange,PQ-val,QuantSig,PEP,MassErrorPPM
MMGISKTEINLR,nta,M,1,true,"Arabidopsis translation initiation landscape - NTA",167a,35069635,,,,,,,,
MMGISKTEINLR,ph,T,7,true,"Tissue atlas Arabidopsis - ProteomicsDB",114,32188942,"MaxQuant score",80.3870000,0.9762700,,,,0.00060647702775896,
RLLSAAPNQQNQSK,ph,S,16,false,"TOR Kinase and ABA Receptor",100,29290610,XCorr,3.1399767,0.9999000,,,,0.00014910000027157,
RLLSAAPNQQNQSK,ph,S,16,false,"Tissue atlas Arabidopsis - ProteomicsDB",114,32188942,"MaxQuant score",174.4400000,1.0000000,,,,2.0979000752986E-15,
LLSAAPNQQNQSK,ph,S,16,false,"atm and atr DNA damage response",88,25561503,"MASCOT Score",55.0000000,1.0000000,,,,,0.0100000
LLSAAPNQQNQSK,ph,S,16,false,"Phospho cell culture sucrose/TOR",109,30833711,,,0.9999970,,,,,
LLSAAPNQQNQSK,ph,S,16,false,"Tissue atlas Arabidopsis - ProteomicsDB",114,32188942,"MaxQuant score",174.4400000,1.0000000,,,,2.0979000752986E-15,
EQLEQLSEEKTPEGLPR,ub,K,45,true,"Arabidopsis ubiquitination COFRADIC",40,26744219,"MaxQuant Score",77.2210000,1.0000000,,,,1.560999995931E-9,0.1010000
IASQEPETEVSDEPFAK,ph,T,79,true,"Tissue atlas Arabidopsis - ProteomicsDB",114,32188942,"MaxQuant score",114.2400000,0.9745560,,,,1.3873400206421E-8,
DSTSGSSPKIEDEPR,ph,S,95,true,"atm and atr DNA damage response",88,25561503,"MASCOT Score",28.0000000,0.9860000,,,,,0.6200000
IEDEPRSPTSPQLRR,ph,S,104,true,"TOR Kinase and ABA Receptor",100,29290610,XCorr,2.8013923,0.9988000,,,,0.015780000016093,
IEDEPRSPTSPQLR,ph,S,104,true,"Tyrosine phosphorylation in Arabidopsis",59,18463617,"MASCOT Score",23.0000000,,,,,,-0.9977778
IEDEPRSPTSPQLR,ph,S,104,true,"atm and atr DNA damage response",88,25561503,"MASCOT Score",21.0000000,1.0000000,,,,,-0.9400000
IEDEPRSPTSPQLR,ph,S,104,true,"TOR Kinase and ABA Receptor",100,29290610,XCorr,2.5039907,0.9999000,,,,0.0090239997953176,
IEDEPRSPTSPQLR,ph,S,104,true,"Tissue atlas Arabidopsis - ProteomicsDB",114,32188942,"MaxQuant score",174.5900000,0.9999170,,,,6.7713698451816E-16,
IEDEPRSPTSPQLR,ph,T,106,true,"LAXIC - mannitol vs control",84b,23660473,XCorr,2.1900000,0.8740000,,,,0.0010955700417981,
SPTSPQLR,ph,T,106,true,"Lateral root-induction - NAA vs control",106,23328941,"MASCOT Score",25.0000000,,,,,,
SPTSPQLR,ph,T,106,true,"Tissue atlas Arabidopsis - ProteomicsDB",114,32188942,"MaxQuant score",175.9300000,0.9719850,,,,5.5889998575379E-14,
IEDEPRSPTSPQLR,ph,S,107,true,"LAXIC - mannitol vs control",84b,23660473,XCorr,2.1900000,0.8740000,,,,0.0010955700417981,
IEDEPRSPTSPQLR,ph,S,107,true,"atm and atr DNA damage response",88,25561503,"MASCOT Score",21.0000000,0.9930000,,,,,-0.9400000
IEDEPRSPTSPQLR,ph,S,107,true,"Tissue atlas Arabidopsis - ProteomicsDB",114,32188942,"MaxQuant score",171.5600000,0.9879820,,,,6.7713698451816E-16,
SPTSPQLR,ph,S,107,true,"Tyrosine phosphorylation in Arabidopsis",59,18463617,"MASCOT Score",31.0000000,,,,,,0.0000000
SPTSPQLR,ph,S,107,true,"Chloroplast kinase substrates",60,19376835,"MASCOT Score",40.6500000,,,,,,-0.2435530
SPTSPQLR,ph,S,107,true,"atm and atr DNA damage response",88,25561503,"MASCOT Score",35.0000000,0.9990000,,,,,0.0000000
SPTSPQLR,ph,S,107,true,"TOR Kinase and ABA Receptor",100,29290610,XCorr,2.5014329,0.9099000,,,,0.001587999984622,
SPTSPQLR,ph,S,107,true,"Lateral root-induction - NAA vs control",106,23328941,"MASCOT Score",35.0000000,,,,,,
SPTSPQLR,ph,S,107,true,"Phospho cell culture sucrose/TOR",109,30833711,,,0.9739160,,,,,
SPTSPQLR,ph,S,107,true,"Col-0 callus - FC Col-0 vs. Col-0 Xray",111a,31410901,,31.2800000,,-1.1305548,0.0000000,NO,,-0.0759840
SPTSPQLR,ph,S,107,true,"Col-0 X-ray callus - FC Col-0 vs. Col-0 Xray",111b,31410901,,31.2800000,,-1.1305548,0.0000000,NO,,-0.0759840
SPTSPQLR,ph,S,107,true,"atm callus - FC atm vs. atm Xray",111c,31410901,,31.2800000,,-2.0025594,0.0000000,NO,,-0.0759840
SPTSPQLR,ph,S,107,true,"atm-3 X-ray callus - FC atm vs. atm Xray",111d,31410901,,31.2800000,,-2.0025594,0.0000000,NO,,-0.0759840
EQSFDAADADSSKPIK,ph,S,123,true,"atm and atr DNA damage response",88,25561503,"MASCOT Score",37.0000000,1.0000000,,,,,-2.0000000
EQSFDAADADSSKPIK,ph,S,123,true,"Tissue atlas Arabidopsis - ProteomicsDB",114,32188942,"MaxQuant score",166.6700000,1.0000000,,,,9.0659801636909E-19,
EQSFDAADADSSKPIK,ph,S,131,true,"Tissue atlas Arabidopsis - ProteomicsDB",114,32188942,"MaxQuant score",60.9390000,0.7637490,,,,0.00022652299958281,
