Peptide,PTM,ModifiedAA,ModifiedPosition,PeptideUniqueToGene,ExperimentDesc,ExpID,PubmedID,ScoreType,IdentScore,LocProb,Log2FChange,PQ-val,QuantSig,PEP,MassErrorPPM
ANPWWVGNVAIGGVESPVTSSAPSLHHR,nta,A,2,true,"HUNTER N-terminome: legumain, GluC and trypsin",119,31951383,"MaxQuant score",99.9760000,,,,,,
NSNNNNPPTMTR,ph,S,31,true,"Tissue atlas Arabidopsis - ProteomicsDB",114,32188942,"MaxQuant score",79.0360000,0.9999990,,,,0.0016182799590752,
LDHDFTTNNSGSPNTQTQSQEEQNSRDEQPAVEPGSGSGSTGR,ph,T,51,true,"TOR Kinase and ABA Receptor",100,29290610,XCorr,3.3823574,0.8055000,,,,0.0010250000050291,
LDHDFTTNNSGSPNTQTQSQEEQNSRDEQPAVEPGSGSGSTGR,ph,T,52,true,"TOR Kinase and ABA Receptor",100,29290610,XCorr,3.3823574,0.8055000,,,,0.0010250000050291,
LDHDFTTNNSGSPNTQTQSQEEQNSRDEQPAVEPGSGSGSTGR,ph,S,55,true,"TOR Kinase and ABA Receptor",100,29290610,XCorr,4.5501714,0.7976000,,,,0.0024830000475049,
LDHDFTTNNSGSPNTQTQSQEEQNSR,ph,S,55,true,"Col-0 callus - FC Col-0 vs. Col-0 Xray",111a,31410901,,73.1100000,,-0.3165580,0.0000000,NO,,1.0940041
LDHDFTTNNSGSPNTQTQSQEEQNSR,ph,S,55,true,"Col-0 X-ray callus - FC Col-0 vs. Col-0 Xray",111b,31410901,,73.1100000,,-0.3165580,0.0000000,NO,,1.0940041
LDHDFTTNNSGSPNTQTQSQEEQNSR,ph,S,55,true,"atm callus - FC atm vs. atm Xray",111c,31410901,,73.1100000,,-0.1818143,0.0000000,NO,,1.0940041
LDHDFTTNNSGSPNTQTQSQEEQNSR,ph,S,55,true,"atm-3 X-ray callus - FC atm vs. atm Xray",111d,31410901,,73.1100000,,-0.1818143,0.0000000,NO,,1.0940041
LDHDFTTNNSGSPNTQTQSQEEQNSRDEQPAVEPGSGSGSTGR,ph,S,57,true,"TOR Kinase and ABA Receptor",100,29290610,XCorr,4.5501714,0.8035000,,,,0.0024830000475049,
LDHDFTTNNSGSPNTQTQSQEEQNSR,ph,S,57,true,"LAXIC - mannitol vs control",84b,23660473,XCorr,5.4600000,0.8870000,,,,8.0799997497893E-16,
LDHDFTTNNSGSPNTQTQSQEEQNSR,ph,S,57,true,"SnRK2 protein kinase substrates",85,23776212,XCorr,4.4732637,0.9970000,,,,8.1661001194821E-16,
LDHDFTTNNSGSPNTQTQSQEEQNSR,ph,S,57,true,"Lateral root-induction - NAA vs control",106,23328941,"MASCOT Score",56.0000000,,,,,,
LDHDFTTNNSGSPNTQTQSQEEQNSR,ph,S,57,true,"Phospho cell culture sucrose/TOR",109,30833711,,,0.9979750,,,,,
LDHDFTTNNSGSPNTQTQSQEEQNSR,ph,S,57,true,"Col-0 callus - FC Col-0 vs. Col-0 Xray",111a,31410901,,86.1100000,,-2.5046835,0.0000000,NO,,1.3834962
LDHDFTTNNSGSPNTQTQSQEEQNSR,ph,S,57,true,"Col-0 X-ray callus - FC Col-0 vs. Col-0 Xray",111b,31410901,,86.1100000,,-2.5046835,0.0000000,NO,,1.3834962
LDHDFTTNNSGSPNTQTQSQEEQNSR,ph,S,57,true,"atm callus - FC atm vs. atm Xray",111c,31410901,,86.1100000,,-0.4450773,0.0000000,NO,,1.3834962
LDHDFTTNNSGSPNTQTQSQEEQNSR,ph,S,57,true,"atm-3 X-ray callus - FC atm vs. atm Xray",111d,31410901,,86.1100000,,-0.4450773,0.0000000,NO,,1.3834962
LDHDFTTNNSGSPNTQTQSQEEQNSR,ph,S,57,true,"Tissue atlas Arabidopsis - ProteomicsDB",114,32188942,"MaxQuant score",301.7700000,0.9999510,,,,0,
LDHDFTTNNSGSPNTQTQSQEEQNSR,ph,T,60,true,"Lateral root-induction - NAA vs control",106,23328941,"MASCOT Score",36.0000000,,,,,,
LDHDFTTNNSGSPNTQTQSQEEQNSR,ph,T,60,true,"Col-0 callus - FC Col-0 vs. Col-0 Xray",111a,31410901,,43.8800000,,-0.8891975,0.0000000,NO,,1.1356073
LDHDFTTNNSGSPNTQTQSQEEQNSR,ph,T,60,true,"Col-0 X-ray callus - FC Col-0 vs. Col-0 Xray",111b,31410901,,43.8800000,,-0.8891975,0.0000000,NO,,1.1356073
LDHDFTTNNSGSPNTQTQSQEEQNSR,ph,T,60,true,"atm callus - FC atm vs. atm Xray",111c,31410901,,43.8800000,,-2.2073091,0.0000000,NO,,1.1356073
LDHDFTTNNSGSPNTQTQSQEEQNSR,ph,T,60,true,"atm-3 X-ray callus - FC atm vs. atm Xray",111d,31410901,,43.8800000,,-2.2073091,0.0000000,NO,,1.1356073
LDHDFTTNNSGSPNTQTQSQEEQNSR,ph,T,60,true,"Tissue atlas Arabidopsis - ProteomicsDB",114,32188942,"MaxQuant score",236.2800000,0.9269830,,,,0,
LDHDFTTNNSGSPNTQTQSQEEQNSR,ph,T,62,true,"Col-0 callus - FC Col-0 vs. Col-0 Xray",111a,31410901,,43.8800000,,-0.8891975,0.0000000,NO,,1.1356073
LDHDFTTNNSGSPNTQTQSQEEQNSR,ph,T,62,true,"Col-0 X-ray callus - FC Col-0 vs. Col-0 Xray",111b,31410901,,43.8800000,,-0.8891975,0.0000000,NO,,1.1356073
LDHDFTTNNSGSPNTQTQSQEEQNSR,ph,T,62,true,"atm callus - FC atm vs. atm Xray",111c,31410901,,43.8800000,,-2.2073091,0.0000000,NO,,1.1356073
LDHDFTTNNSGSPNTQTQSQEEQNSR,ph,T,62,true,"atm-3 X-ray callus - FC atm vs. atm Xray",111d,31410901,,43.8800000,,-2.2073091,0.0000000,NO,,1.1356073
LDHDFTTNNSGSPNTQTQSQEEQNSR,ph,S,64,true,"LAXIC - mannitol vs control",84b,23660473,XCorr,5.4600000,0.9670000,,,,8.0799997497893E-16,
DEQPAVEPGSGSGSTGR,ph,S,81,true,"Tissue atlas Arabidopsis - ProteomicsDB",114,32188942,"MaxQuant score",136.6600000,0.7775250,,,,8.4790195697959E-12,
NKPKSPVVVTK,ph,S,103,true,"Phospho cell culture sucrose/TOR",109,30833711,,,1.0000000,,,,,
NKPKSPVVVTK,ph,S,103,true,"Col-0 callus - FC Col-0 vs. Col-0 Xray",111a,31410901,,34.9800000,,-3.4527935,0.0000000,NO,,-0.1891751
NKPKSPVVVTK,ph,S,103,true,"Col-0 X-ray callus - FC Col-0 vs. Col-0 Xray",111b,31410901,,34.9800000,,-3.4527935,0.0000000,NO,,-0.1891751
NKPKSPVVVTK,ph,S,103,true,"atm callus - FC atm vs. atm Xray",111c,31410901,,34.9800000,,2.2955300,0.0000000,NO,,-0.1891751
NKPKSPVVVTK,ph,S,103,true,"atm-3 X-ray callus - FC atm vs. atm Xray",111d,31410901,,34.9800000,,2.2955300,0.0000000,NO,,-0.1891751
NKPKSPVVVTK,ph,S,103,true,"Tissue atlas Arabidopsis - ProteomicsDB",114,32188942,"MaxQuant score",70.2600000,0.9997210,,,,0.0010571799939498,
