Peptide,PTM,ModifiedAA,ModifiedPosition,PeptideUniqueToGene,ExperimentDesc,ExpID,PubmedID,ScoreType,IdentScore,LocProb,Log2FChange,PQ-val,QuantSig,PEP,MassErrorPPM
GDAIDLSGDGGVLKKIVR,nt,G,2,true,"Stromal N-terminome",96,26371235,"MASCOT Score",32.4600000,,,,,,
GDAIDLSGDG,nt,G,2,true,"N-term acetylation drought responses",5,26184543,,,,,,,,
GDAIDLSGDGGVLKKIVR,nta,G,2,true,"Arg/N-end rule pathway Roots",80,25728785,"MASCOT Score",32.8800000,,,,,0.00057299999753013,
GDAIDLSGDGGVLKKIVR,nta,G,2,true,"Stromal N-terminome",96,26371235,"MASCOT Score",32.4600000,,,,,,
GDAIDLSGDGGVLKKIVR,nta,G,2,true,"FtsH12 N-terminome: WT / FtsH12 knockdown miRNA",118,33216923,"MaxQuant score",57.2930000,,,,,0.00042098999256268,
GDAIDLSGDGGVLKKIVR,nta,G,2,true,"HUNTER N-terminome: legumain, GluC and trypsin",119,31951383,"MaxQuant score",,,,,,,
GDAIDLSGDGGVLKKIVR,nta,G,2,true,"Arabidopsis translation initiation landscape - NTA",167a,35069635,,,,,,,,
GDAIDLSGDGGVLK,nta,G,2,true,"Characterization plant N-terminal acetylation",6,22223895,"MASCOT Score",42.3400000,,,,,,
GDAIDLSGDG,nta,G,2,true,"N-term acetylation drought responses",5,26184543,,,,,,,,
GDAIDLSGD,nta,G,2,true,"HUNTER N-terminome: legumain, GluC and trypsin",119,31951383,"MaxQuant score",92.1870000,,,,,,
KGASVGSVSEER,ph,S,127,true,"atm and atr DNA damage response",88,25561503,"MASCOT Score",50.0000000,1.0000000,,,,,-1.9100000
KGASVGSVSEER,ph,S,127,true,"Tissue atlas Arabidopsis - ProteomicsDB",114,32188942,"MaxQuant score",139.7100000,0.9999730,,,,7.6225101111049E-6,
KGASVGSVSEER,ph,S,130,true,"Tissue atlas Arabidopsis - ProteomicsDB",114,32188942,"MaxQuant score",120.5900000,0.9898720,,,,2.5247700250475E-5,
KGASVGSVSEER,ph,S,132,true,"Tissue atlas Arabidopsis - ProteomicsDB",114,32188942,"MaxQuant score",94.7170000,0.8645400,,,,0.00014339099288918,
LEDLKKQR,ub,K,142,true,"Arabidopsis ubiquitination COFRADIC",40,26744219,"MaxQuant Score",77.7320000,0.8990000,,,,0.0080000003799796,-0.2210000
LEDLKKQR,ub,K,143,true,"Arabidopsis ubiquitination COFRADIC",40,26744219,"MaxQuant Score",114.2800000,0.9170000,,,,0.0010000000474975,0.0860000
