Peptide,PTM,ModifiedAA,ModifiedPosition,PeptideUniqueToGene,ExperimentDesc,ExpID,PubmedID,ScoreType,IdentScore,LocProb,Log2FChange,PQ-val,QuantSig,PEP,MassErrorPPM
WSSFLEDHVESTELPTNGSSENIHAPFSESEK,ph,S,79,true,"Tissue atlas Arabidopsis - ProteomicsDB",114,32188942,"MaxQuant score",141.5700000,0.7514820,,,,0,
LGSDVTPDNASEEEGHPDAEK,ph,T,116,true,"LAXIC - mannitol vs control",84b,23660473,XCorr,2.9900000,0.9600000,,,,0.0038583199493587,
LGSDVTPDNASEEEGHPDAEK,ph,T,116,true,"TOR Kinase and ABA Receptor",100,29290610,XCorr,3.9840152,0.9999000,,,,0.00011259999882895,
LGSDVTPDNASEEEGHPDAEK,ph,T,116,true,"Tissue atlas Arabidopsis - ProteomicsDB",114,32188942,"MaxQuant score",134.4000000,0.9999500,,,,1.9790399653882E-22,
LGSDVTPDNASEEEGHPDAEK,ph,S,121,true,"STN8 phosphoproteome",38,21768351,"MASCOT Score",55.5100000,,,,,,-0.3926900
LGSDVTPDNASEEEGHPDAEK,ph,S,121,true,"Chloroplast kinase substrates",60,19376835,"MASCOT Score",42.1400000,,,,,,-0.6822990
LGSDVTPDNASEEEGHPDAEK,ph,S,121,true,"srk2dei ABA signaling phopshoproteomics",83,23572148,"MASCOT Score",75.0000000,,,,,,0.0004000
LGSDVTPDNASEEEGHPDAEK,ph,S,121,true,"LAXIC - mannitol vs control",84b,23660473,XCorr,3.3200000,0.9750000,,,,1.6699999605407E-6,
LGSDVTPDNASEEEGHPDAEK,ph,S,121,true,"SnRK2 protein kinase substrates",85,23776212,XCorr,5.3085475,1.0000000,,,,2.2068700644695E-8,
LGSDVTPDNASEEEGHPDAEK,ph,S,121,true,"atm and atr DNA damage response",88,25561503,"MASCOT Score",68.0000000,1.0000000,,,,,0.1700000
LGSDVTPDNASEEEGHPDAEK,ph,S,121,true,"TOR Kinase and ABA Receptor",100,29290610,XCorr,5.4741740,1.0000000,,,,8.1080003155876E-8,
LGSDVTPDNASEEEGHPDAEK,ph,S,121,true,"Lateral root-induction - NAA vs control",106,23328941,"MASCOT Score",70.0000000,,,,,,
LGSDVTPDNASEEEGHPDAEK,ph,S,121,true,"Phospho cell culture sucrose/TOR",109,30833711,,,1.0000000,,,,,
LGSDVTPDNASEEEGHPDAEK,ph,S,121,true,"Col-0 callus - FC Col-0 vs. Col-0 Xray",111a,31410901,,30.1900000,,-1.0648699,0.0000000,NO,,0.6149492
LGSDVTPDNASEEEGHPDAEK,ph,S,121,true,"Col-0 X-ray callus - FC Col-0 vs. Col-0 Xray",111b,31410901,,30.1900000,,-1.0648699,0.0000000,NO,,0.6149492
LGSDVTPDNASEEEGHPDAEK,ph,S,121,true,"atm callus - FC atm vs. atm Xray",111c,31410901,,30.1900000,,-0.1250529,0.0000000,NO,,0.6149492
LGSDVTPDNASEEEGHPDAEK,ph,S,121,true,"atm-3 X-ray callus - FC atm vs. atm Xray",111d,31410901,,30.1900000,,-0.1250529,0.0000000,NO,,0.6149492
LGSDVTPDNASEEEGHPDAEK,ph,S,121,true,"Tissue atlas Arabidopsis - ProteomicsDB",114,32188942,"MaxQuant score",265.1300000,1.0000000,,,,0,
VKISPSFDDAK,ph,S,176,true,"atm and atr DNA damage response",88,25561503,"MASCOT Score",36.0000000,1.0000000,,,,,-1.8600000
VKISPSFDDAK,ph,S,176,true,"Tissue atlas Arabidopsis - ProteomicsDB",114,32188942,"MaxQuant score",151.3000000,0.9996740,,,,2.3584899366824E-8,
ISPSFDDAKSSK,ph,S,178,true,"LAXIC - mannitol vs control",84b,23660473,XCorr,2.9700000,0.9970000,,,,0.053099699318409,
ISPSFDDAKSSK,ph,S,178,true,"atm and atr DNA damage response",88,25561503,"MASCOT Score",31.0000000,1.0000000,,,,,-4.1500000
ISPSFDDAK,ph,S,178,true,"Large-scale phosphorylation discovery",44,23111157,XCorr,2.5620000,,,,,,
ISPSFDDAK,ph,S,178,true,"srk2dei ABA signaling phopshoproteomics",83,23572148,"MASCOT Score",30.0000000,,,,,,0.0001000
ISPSFDDAK,ph,S,178,true,"SnRK2 protein kinase substrates",85,23776212,XCorr,2.0078058,1.0000000,,,,0.02883530035615,
ISPSFDDAK,ph,S,178,true,"atm and atr DNA damage response",88,25561503,"MASCOT Score",53.0000000,1.0000000,,,,,-0.2800000
ISPSFDDAK,ph,S,178,true,"Tissue atlas Arabidopsis - ProteomicsDB",114,32188942,"MaxQuant score",121.6100000,0.9999860,,,,5.9033300203737E-5,
ISPSFDDAKSSK,ph,S,184,true,"LAXIC - mannitol vs control",84b,23660473,XCorr,2.9700000,0.9510000,,,,0.053099699318409,
ISPSFDDAKSSK,ph,S,184,true,"SnRK2 protein kinase substrates",85,23776212,XCorr,2.9761000,0.9450000,,,,0.040855001658201,
ISPSFDDAKSSK,ph,S,184,true,"atm and atr DNA damage response",88,25561503,"MASCOT Score",31.0000000,0.9950000,,,,,-4.1500000
ISPSFDDAKSSK,ph,S,184,true,"Tissue atlas Arabidopsis - ProteomicsDB",114,32188942,"MaxQuant score",138.7300000,0.9999290,,,,5.3829498938285E-6,
ISPSFDDAKSSK,ph,S,185,true,"Tissue atlas Arabidopsis - ProteomicsDB",114,32188942,"MaxQuant score",95.8540000,0.9998730,,,,0.00030424501164816,
GASDIDSEDEFYDVER,ph,S,189,true,"STN8 phosphoproteome",38,21768351,"MASCOT Score",78.5700000,,,,,,
GASDIDSEDEFYDVER,ph,S,189,true,"PAMP-triggered phosphorylation",48,24601666,"MASCOT Score",53.7400000,,,,,,
GASDIDSEDEFYDVER,ph,S,189,true,"Tyrosine phosphorylation in Arabidopsis",59,18463617,"MASCOT Score",81.0000000,,,,,,-0.5712151
GASDIDSEDEFYDVER,ph,S,189,true,"Conserved plant phosphoproteome - Arabidopsis",61a,20466843,"MASCOT Score",67.0000000,1.0000000,,,,,
GASDIDSEDEFYDVER,ph,S,189,true,"srk2dei ABA signaling phopshoproteomics",83,23572148,"MASCOT Score",72.0000000,,,,,,-0.0002000
GASDIDSEDEFYDVER,ph,S,189,true,"LAXIC - ABA stress",84a,23660473,XCorr,4.7600000,1.0000000,,,,0.0022036500740796,
GASDIDSEDEFYDVER,ph,S,189,true,"LAXIC - mannitol vs control",84b,23660473,XCorr,5.6900000,1.0000000,3.1881617,,NO,1.8900000213762E-6,
GASDIDSEDEFYDVER,ph,S,189,true,"SnRK2 protein kinase substrates",85,23776212,XCorr,5.2307992,1.0000000,,,,5.536840083642E-11,
GASDIDSEDEFYDVER,ph,S,189,true,"atm and atr DNA damage response",88,25561503,"MASCOT Score",78.0000000,1.0000000,,,,,-0.4400000
GASDIDSEDEFYDVER,ph,S,189,true,"TOR Kinase and ABA Receptor",100,29290610,XCorr,5.6604166,1.0000000,,,,4.9939998802984E-8,
GASDIDSEDEFYDVER,ph,S,189,true,"Lateral root-induction - NAA vs control",106,23328941,"MASCOT Score",60.0000000,,,,,,
GASDIDSEDEFYDVER,ph,S,189,true,"Phospho cell culture sucrose/TOR",109,30833711,,,1.0000000,,,,,
GASDIDSEDEFYDVER,ph,S,189,true,"Col-0 callus - FC Col-0 vs. Col-0 Xray",111a,31410901,,70.5300000,,0.6936489,0.0379315,YES,,1.1501899
GASDIDSEDEFYDVER,ph,S,189,true,"Col-0 X-ray callus - FC Col-0 vs. Col-0 Xray",111b,31410901,,70.5300000,,0.6936489,0.0379315,YES,,1.1501899
GASDIDSEDEFYDVER,ph,S,189,true,"atm callus - FC atm vs. atm Xray",111c,31410901,,70.5300000,,0.8752154,0.0818175,NO,,1.1501899
GASDIDSEDEFYDVER,ph,S,189,true,"atm-3 X-ray callus - FC atm vs. atm Xray",111d,31410901,,70.5300000,,0.8752154,0.0818175,NO,,1.1501899
GASDIDSEDEFYDVER,ph,S,189,true,"Tissue atlas Arabidopsis - ProteomicsDB",114,32188942,"MaxQuant score",288.4500000,1.0000000,,,,0,
GASDIDSEDEFYDVER,ph,S,193,true,"Phosphorylation nuclei-enriched fractions",28,19245862,,,,,,,,
GASDIDSEDEFYDVER,ph,S,193,true,"STN8 phosphoproteome",38,21768351,"MASCOT Score",77.4600000,,,,,,-2.7137500
GASDIDSEDEFYDVER,ph,S,193,true,"Phosphoproteomic analysis of seed maturation",42,22440515,"MASCOT Score",50.0000000,,,,,,-2.1200000
GASDIDSEDEFYDVER,ph,S,193,true,"Large-scale phosphorylation discovery",44,23111157,XCorr,3.0300000,,,,,,
GASDIDSEDEFYDVER,ph,S,193,true,"PAMP-triggered phosphorylation",48,24601666,"MASCOT Score",53.7400000,,,,,,
GASDIDSEDEFYDVER,ph,S,193,true,"Tyrosine phosphorylation in Arabidopsis",59,18463617,"MASCOT Score",91.0000000,,,,,,-0.6231439
GASDIDSEDEFYDVER,ph,S,193,true,"srk2dei ABA signaling phopshoproteomics",83,23572148,"MASCOT Score",85.0000000,,,,,,-0.0015000
GASDIDSEDEFYDVER,ph,S,193,true,"LAXIC - ABA stress",84a,23660473,XCorr,5.6400000,1.0000000,,,,0.0074424701742828,
GASDIDSEDEFYDVER,ph,S,193,true,"LAXIC - mannitol vs control",84b,23660473,XCorr,5.6900000,1.0000000,3.1881617,,NO,1.8900000213762E-6,
GASDIDSEDEFYDVER,ph,S,193,true,"SnRK2 protein kinase substrates",85,23776212,XCorr,5.2307992,1.0000000,,,,5.536840083642E-11,
GASDIDSEDEFYDVER,ph,S,193,true,"atm and atr DNA damage response",88,25561503,"MASCOT Score",103.0000000,1.0000000,,,,,0.0200000
GASDIDSEDEFYDVER,ph,S,193,true,"TOR Kinase and ABA Receptor",100,29290610,XCorr,5.6604166,1.0000000,,,,4.9939998802984E-8,
GASDIDSEDEFYDVER,ph,S,193,true,"Lateral root-induction - NAA vs control",106,23328941,"MASCOT Score",56.0000000,,,,,,
GASDIDSEDEFYDVER,ph,S,193,true,"Col-0 callus - FC Col-0 vs. Col-0 Xray",111a,31410901,,72.6500000,,0.9091263,0.0236316,YES,,1.1969551
GASDIDSEDEFYDVER,ph,S,193,true,"Col-0 X-ray callus - FC Col-0 vs. Col-0 Xray",111b,31410901,,72.6500000,,0.9091263,0.0236316,YES,,1.1969551
GASDIDSEDEFYDVER,ph,S,193,true,"atm callus - FC atm vs. atm Xray",111c,31410901,,72.6500000,,0.9269388,0.0403025,YES,,1.1969551
GASDIDSEDEFYDVER,ph,S,193,true,"atm-3 X-ray callus - FC atm vs. atm Xray",111d,31410901,,72.6500000,,0.9269388,0.0403025,YES,,1.1969551
GASDIDSEDEFYDVER,ph,S,193,true,"Tissue atlas Arabidopsis - ProteomicsDB",114,32188942,"MaxQuant score",370.4400000,1.0000000,,,,0,
GASDIDSEDEFYDVER,ph,S,193,true,"Touch-induced phosphorylation: 40s touch vs untouc",136,30291188,"MASCOT score",124.5700000,,0.0416893,0.8445508,NO,,-3.8490643
ARHNPSVGY,nt,A,340,false,"Arabidopsis translation initiation landscape - NT",167b,35069635,,,,,,,,
SKHRPAVIAALEER,nt,S,519,true,"Arabidopsis translation initiation landscape - NT",167b,35069635,,,,,,,,
ASLSNGSLSR,ph,S,568,false,"Tissue atlas Arabidopsis - ProteomicsDB",114,32188942,"MaxQuant score",89.1330000,0.9934920,,,,0.0014161700382829,
ASLSNGSLSR,ph,S,571,false,"Lateral root-induction - NAA vs control",106,23328941,"MASCOT Score",53.0000000,,,,,,
ASLSNGSLSR,ph,S,571,false,"Tissue atlas Arabidopsis - ProteomicsDB",114,32188942,"MaxQuant score",132.6200000,0.9340900,,,,2.3171700377134E-5,
ASLSNGSLSR,ph,S,573,false,"atm and atr DNA damage response",88,25561503,"MASCOT Score",56.0000000,0.9970000,,,,,0.2900000
ASLSNGSLSR,ph,S,573,false,"Lateral root-induction - NAA vs control",106,23328941,"MASCOT Score",34.0000000,,,,,,
ASLSNGSLSR,ph,S,573,false,"Tissue atlas Arabidopsis - ProteomicsDB",114,32188942,"MaxQuant score",210.4400000,0.9752800,,,,6.3971402076724E-20,
VEQEQKVTEDAR,me1,K,685,true,"Arabidopsis protein methylome",123,31809900,"MaxQuant Score",182.3300000,1.0000000,,,,0,0.3849200
QVNQDSSPEPPPSR,ph,S,758,true,"Tissue atlas Arabidopsis - ProteomicsDB",114,32188942,"MaxQuant score",253.7900000,0.9966800,,,,0,
NTTPEKSPEHVNDEK,ph,T,785,true,"Tissue atlas Arabidopsis - ProteomicsDB",114,32188942,"MaxQuant score",123.3400000,0.9944760,,,,4.5916400267743E-5,
NTTPEKSPEHVNDEK,ph,S,789,true,"Tissue atlas Arabidopsis - ProteomicsDB",114,32188942,"MaxQuant score",160.4700000,1.0000000,,,,5.1323501655196E-13,
