Peptide,PTM,ModifiedAA,ModifiedPosition,PeptideUniqueToGene,ExperimentDesc,ExpID,PubmedID,ScoreType,IdentScore,LocProb,Log2FChange,PQ-val,QuantSig,PEP,MassErrorPPM
VLSMSKKDGR,nta,V,47,true,"Arabidopsis translation initiation landscape - NTA",167a,35069635,,,,,,,,
SMSKKDGRT,nt,S,49,true,"Arabidopsis translation initiation landscape - NT",167b,35069635,,,,,,,,
SMSKKDGRT,nta,S,49,true,"Arabidopsis translation initiation landscape - NTA",167a,35069635,,,,,,,,
SKKDGRTDKDDDTDSLNYKDSGVDIDAGAELVKR,nt,S,51,true,"Mitochondrial intermediate peptidases - oct1-2 / WT",131c,25732537,,51.5300000,,0.0933733,,,,
SKKDGRTDKDDDTDSLNYKDSGVDIDAGAE,nt,S,51,true,"HUNTER N-terminome: legumain, GluC and trypsin",119,31951383,"MaxQuant score",71.9740000,,,,,,
DGRTDKDDDTDSLNYK,ph,T,57,true,"Tissue atlas Arabidopsis - ProteomicsDB",114,32188942,"MaxQuant score",197.2800000,1.0000000,,,,4.1768699283707E-36,
TDKDDDTDSLNYK,ph,T,63,true,"Tissue atlas Arabidopsis - ProteomicsDB",114,32188942,"MaxQuant score",133.9600000,0.9967170,,,,0.00024630999541841,
DSGVDIDAGAELVKR,nt,D,70,true,"Metacaspase9 substrates - in vitro rMC9",51c,23964026,"MASCOT Score",73.0000000,,3.4916605,,NO,,-1.0095794
GIVEGCR,so,C,176,true,"S-sulfenylation site detection using YAP1C",110,32714340,,,,,,,,
GLAHITGGGFTDNIPR,ph,T,296,true,"Tissue atlas Arabidopsis - ProteomicsDB",114,32188942,"MaxQuant score",89.8570000,0.9999670,,,,5.7749799452722E-5,
ILEEVKNGDYVAYR,ac,K,368,true,"Quantitative Acetylproteomics",101,29440448,,,,,,,,
