Peptide,PTM,ModifiedAA,ModifiedPosition,PeptideUniqueToGene,ExperimentDesc,ExpID,PubmedID,ScoreType,IdentScore,LocProb,Log2FChange,PQ-val,QuantSig,PEP,MassErrorPPM
TKEVVGDKRS,nt,T,2,true,"N-term acetylation drought responses",5,26184543,,,,,,,,
TKEVVGDKR,ac,K,9,true,"Quantitative Acetylproteomics",101,29440448,,,,,,,,
SFSGKDYQDPPPEPLFDATELGK,ph,S,13,true,"Tissue atlas Arabidopsis - ProteomicsDB",114,32188942,"MaxQuant score",158.1500000,0.9981850,,,,5.0132601625961E-39,
TIPITGTGINPAR,nt,T,218,false,"Arg/N-end rule seed, prt6 vs. Wt",99,29168982,"MASCOT Score",59.1200000,,,,,0.0047100000083447,-0.2771244
ALGSFRSQPHV,ph,S,279,true,"Phosphoproteome ethylene-regulated time response",46,24043427,"MASCOT Score",27.1500000,,,,,,-6.4477000
ALGSFRSQPHV,ph,S,279,true,"atm and atr DNA damage response",88,25561503,"MASCOT Score",37.0000000,1.0000000,,,,,0.0100000
ALGSFRSQPHV,ph,S,279,true,"TOR Kinase and ABA Receptor",100,29290610,XCorr,2.8197930,1.0000000,,,,0.085239998996258,
ALGSFRSQPHV,ph,S,279,true,"Tissue atlas Arabidopsis - ProteomicsDB",114,32188942,"MaxQuant score",108.9700000,1.0000000,,,,2.709060026973E-5,
ALGSFR,ph,S,279,false,"Phosphorylation in N starvation",63,22060019,"MASCOT Score",99.0000000,,,,,,-3.8373400
ALGSFR,ph,S,279,false,"srk2dei ABA signaling phopshoproteomics",83,23572148,"MASCOT Score",43.0000000,,,,,,-0.0001000
ALGSFR,ph,S,279,false,"SIRK1 phosphorylation",86a,23820729,"MaxQuant Score",145.6300000,1.0000000,,,,0.00072670000372455,7.5270000
ALGSFR,ph,S,279,false,"SIRK1 exp - sirk1 mutant vs WT",86b,23820729,,,,-2.7240124,,NO,,
ALGSFR,ph,S,279,false,"SIRK1 exp - 35S:SIRK1 vs WT",86c,23820729,,,,1.5615577,,NO,,
ALGSFR,ph,S,279,false,"TOR Kinase and ABA Receptor",100,29290610,XCorr,2.1681764,1.0000000,,,,0.002066999906674,
LGSFR,ph,S,279,false,"Tyrosine phosphorylation in Arabidopsis",59,18463617,"MASCOT Score",37.0000000,,,,,,-0.7595512
LGSFR,ph,S,279,false,"srk2dei ABA signaling phopshoproteomics",83,23572148,"MASCOT Score",37.0000000,,,,,,-0.0004000
ALGSFRSQPHV,ph,S,282,true,"Phosphoproteome ethylene-regulated time response",46,24043427,"MASCOT Score",27.1500000,,,,,,-6.4477000
ALGSFRSQPHV,ph,S,282,true,"atm and atr DNA damage response",88,25561503,"MASCOT Score",37.0000000,1.0000000,,,,,0.0100000
ALGSFRSQPHV,ph,S,282,true,"TOR Kinase and ABA Receptor",100,29290610,XCorr,2.8197930,1.0000000,,,,0.085239998996258,
ALGSFRSQPHV,ph,S,282,true,"Tissue atlas Arabidopsis - ProteomicsDB",114,32188942,"MaxQuant score",108.9700000,1.0000000,,,,2.709060026973E-5,
