Peptide,PTM,ModifiedAA,ModifiedPosition,PeptideUniqueToGene,ExperimentDesc,ExpID,PubmedID,ScoreType,IdentScore,LocProb,Log2FChange,PQ-val,QuantSig,PEP,MassErrorPPM
MDSHSSHLNAANR,nta,M,1,true,"Arg/N-end rule pathway Roots",80,25728785,"MASCOT Score",47.0600000,,,,,0.00048620000598021,
MDSHSSHLNAANR,nta,M,1,true,"Arabidopsis translation initiation landscape - NTA",167a,35069635,,,,,,,,
MDSHSSHLNAANR,fuc,S,3,true,"SPINDLY O-fucosylation",162,36739885,,,,,,,-0.28999999165535,
MDSHSSHLNAANR,ph,S,3,true,"Tissue atlas Arabidopsis - ProteomicsDB",114,32188942,"MaxQuant score",90.7060000,0.9974750,,,,7.8800498158671E-5,
MDSHSSHLNAANR,ph,S,5,true,"atm and atr DNA damage response",88,25561503,"MASCOT Score",43.0000000,0.9890000,,,,,-0.6000000
MDSHSSHLNAANR,ph,S,5,true,"Tissue atlas Arabidopsis - ProteomicsDB",114,32188942,"MaxQuant score",158.8900000,0.9916610,,,,9.2983197530483E-11,
MDSHSSHLNAANR,ph,S,6,true,"atm and atr DNA damage response",88,25561503,"MASCOT Score",43.0000000,1.0000000,,,,,-0.6000000
MDSHSSHLNAANR,ph,S,6,true,"Tissue atlas Arabidopsis - ProteomicsDB",114,32188942,"MaxQuant score",129.1500000,0.9977350,,,,1.8196900782641E-5,
SSQTPSPSHSASASVTSSLHK,ph,T,19,true,"atm and atr DNA damage response",88,25561503,"MASCOT Score",79.0000000,1.0000000,,,,,0.4500000
SSQTPSPSHSASASVTSSLHK,ph,T,19,true,"TOR Kinase and ABA Receptor",100,29290610,XCorr,3.0569925,0.7786000,,,,0.00013109999417793,
SSQTPSPSHSASASVTSSLHK,ph,T,19,true,"Phospho cell culture sucrose/TOR",109,30833711,,,0.9928690,,,,,
SSQTPSPSHSASASVTSSLHK,ph,T,19,true,"Tissue atlas Arabidopsis - ProteomicsDB",114,32188942,"MaxQuant score",188.8600000,0.9997760,,,,2.8025969286496E-45,
SSQTPSPSHSASASVTSSLHK,ph,S,21,true,"srk2dei ABA signaling phopshoproteomics",83,23572148,"MASCOT Score",25.0000000,,,,,,-0.0003000
SSQTPSPSHSASASVTSSLHK,ph,S,21,true,"atm and atr DNA damage response",88,25561503,"MASCOT Score",79.0000000,1.0000000,,,,,0.4500000
SSQTPSPSHSASASVTSSLHK,ph,S,21,true,"TOR Kinase and ABA Receptor",100,29290610,XCorr,3.4246728,0.7885000,,,,5.3399998023451E-7,
SSQTPSPSHSASASVTSSLHK,ph,S,21,true,"Phospho cell culture sucrose/TOR",109,30833711,,,0.9573520,,,,,
SSQTPSPSHSASASVTSSLHK,ph,S,21,true,"Col-0 callus - FC Col-0 vs. Col-0 Xray",111a,31410901,,22.8300000,,-1.9366773,0.0000000,NO,,0.6267232
SSQTPSPSHSASASVTSSLHK,ph,S,21,true,"Col-0 X-ray callus - FC Col-0 vs. Col-0 Xray",111b,31410901,,22.8300000,,-1.9366773,0.0000000,NO,,0.6267232
SSQTPSPSHSASASVTSSLHK,ph,S,21,true,"atm callus - FC atm vs. atm Xray",111c,31410901,,22.8300000,,-0.2114002,0.0000000,NO,,0.6267232
SSQTPSPSHSASASVTSSLHK,ph,S,21,true,"atm-3 X-ray callus - FC atm vs. atm Xray",111d,31410901,,22.8300000,,-0.2114002,0.0000000,NO,,0.6267232
SSQTPSPSHSASASVTSSLHK,ph,S,21,true,"Tissue atlas Arabidopsis - ProteomicsDB",114,32188942,"MaxQuant score",188.8600000,0.9791940,,,,2.8025969286496E-45,
SSQTPSPSHSASASVTSSLHK,ph,S,23,true,"srk2dei ABA signaling phopshoproteomics",83,23572148,"MASCOT Score",25.0000000,,,,,,-0.0003000
SSQTPSPSHSASASVTSSLHK,ph,S,23,true,"atm and atr DNA damage response",88,25561503,"MASCOT Score",30.0000000,0.8190000,,,,,0.7400000
SSQTPSPSHSASASVTSSLHK,ph,S,23,true,"Phospho cell culture sucrose/TOR",109,30833711,,,0.8086740,,,,,
SSQTPSPSHSASASVTSSLHK,ph,S,23,true,"Tissue atlas Arabidopsis - ProteomicsDB",114,32188942,"MaxQuant score",177.4900000,0.8699820,,,,1.533540009338E-37,
SSQTPSPSHSASASVTSSLHK,ph,S,25,true,"atm and atr DNA damage response",88,25561503,"MASCOT Score",79.0000000,1.0000000,,,,,0.4500000
SSQTPSPSHSASASVTSSLHK,ph,S,25,true,"Tissue atlas Arabidopsis - ProteomicsDB",114,32188942,"MaxQuant score",96.3170000,0.7937720,,,,1.57513002641E-9,
DGALTSNDELESISAR,ph,T,75,true,"atm and atr DNA damage response",88,25561503,"MASCOT Score",45.0000000,1.0000000,,,,,0.1600000
DGALTSNDELESISAR,ph,T,75,true,"Tissue atlas Arabidopsis - ProteomicsDB",114,32188942,"MaxQuant score",219.0300000,0.9934070,,,,0,
DGALTSNDELESISAR,ph,S,76,true,"Large-scale phosphorylation discovery",44,23111157,XCorr,3.8850000,,,,,,
DGALTSNDELESISAR,ph,S,76,true,"Tyrosine phosphorylation in Arabidopsis",59,18463617,"MASCOT Score",67.0000000,,,,,,-1.0815428
DGALTSNDELESISAR,ph,S,76,true,"srk2dei ABA signaling phopshoproteomics",83,23572148,"MASCOT Score",37.0000000,,,,,,-0.0018000
DGALTSNDELESISAR,ph,S,76,true,"atm and atr DNA damage response",88,25561503,"MASCOT Score",53.0000000,0.9950000,,,,,-0.2300000
DGALTSNDELESISAR,ph,S,76,true,"Tissue atlas Arabidopsis - ProteomicsDB",114,32188942,"MaxQuant score",279.9300000,0.9999710,,,,0,
DGALTSNDELESISAR,ph,S,82,true,"atm and atr DNA damage response",88,25561503,"MASCOT Score",48.0000000,1.0000000,,,,,-0.3900000
DGALTSNDELESISAR,ph,S,82,true,"Tissue atlas Arabidopsis - ProteomicsDB",114,32188942,"MaxQuant score",325.3300000,1.0000000,,,,0,
DGALTSNDELESISAR,ph,S,84,true,"Tyrosine phosphorylation in Arabidopsis",59,18463617,"MASCOT Score",76.0000000,,,,,,-0.9676961
DGALTSNDELESISAR,ph,S,84,true,"srk2dei ABA signaling phopshoproteomics",83,23572148,"MASCOT Score",70.0000000,,,,,,-0.0001000
DGALTSNDELESISAR,ph,S,84,true,"SnRK2 protein kinase substrates",85,23776212,XCorr,3.7310522,1.0000000,,,,2.9346199081903E-11,
DGALTSNDELESISAR,ph,S,84,true,"atm and atr DNA damage response",88,25561503,"MASCOT Score",99.0000000,0.9960000,,,,,-0.0300000
DGALTSNDELESISAR,ph,S,84,true,"TOR Kinase and ABA Receptor",100,29290610,XCorr,4.6639452,0.9946000,,,,2.9269999686221E-6,
DGALTSNDELESISAR,ph,S,84,true,"Lateral root-induction - NAA vs control",106,23328941,"MASCOT Score",35.0000000,,,,,,
DGALTSNDELESISAR,ph,S,84,true,"Phospho cell culture sucrose/TOR",109,30833711,,,0.9853910,,,,,
DGALTSNDELESISAR,ph,S,84,true,"Col-0 callus - FC Col-0 vs. Col-0 Xray",111a,31410901,,81.2000000,,0.4344679,0.0000000,NO,,0.8231054
DGALTSNDELESISAR,ph,S,84,true,"Col-0 X-ray callus - FC Col-0 vs. Col-0 Xray",111b,31410901,,81.2000000,,0.4344679,0.0000000,NO,,0.8231054
DGALTSNDELESISAR,ph,S,84,true,"atm callus - FC atm vs. atm Xray",111c,31410901,,81.2000000,,0.8786025,0.0000000,NO,,0.8231054
DGALTSNDELESISAR,ph,S,84,true,"atm-3 X-ray callus - FC atm vs. atm Xray",111d,31410901,,81.2000000,,0.8786025,0.0000000,NO,,0.8231054
DGALTSNDELESISAR,ph,S,84,true,"Tissue atlas Arabidopsis - ProteomicsDB",114,32188942,"MaxQuant score",324.9100000,1.0000000,,,,0,
DGALTSNDELESISAR,ph,S,84,true,"Touch-induced phosphorylation: 40s touch vs untouc",136,30291188,"MASCOT score",110.8100000,,-0.1287656,0.5837904,NO,,3.6130488
GADTDSDPDESEDIVVDDDEDEFAPEQDQDSSIR,ph,T,90,true,"SnRK2 protein kinase substrates",85,23776212,XCorr,3.9310625,0.8310000,,,,0.004490879829973,
GADTDSDPDESEDIVVDDDEDEFAPEQDQDSSIR,ph,T,90,true,"TOR Kinase and ABA Receptor",100,29290610,XCorr,4.2456875,0.9987000,,,,3.1709998893348E-6,
GADTDSDPDESEDIVVDDDEDEFAPEQDQDSSIR,ph,S,92,true,"TOR Kinase and ABA Receptor",100,29290610,XCorr,4.2456875,0.9935000,,,,3.1709998893348E-6,
ELSNCQNVYPK,sno,C,400,true,"hot5-4 / wildtype, FAT-switch S-nitrosoproteome",169,37277371,,,,1.0303493,0.0037180,YES,,
TYNSPDTIYYK,ph,S,537,true,"Tissue atlas Arabidopsis - ProteomicsDB",114,32188942,"MaxQuant score",68.1080000,0.9950480,,,,0.0043792999349535,
VQAGLQSGAKSQ,ac,K,566,true,"Quantitative Acetylproteomics",101,29440448,,,,,,,,
VQAGLQSGAKSQ,ph,S,567,true,"atm and atr DNA damage response",88,25561503,"MASCOT Score",57.0000000,1.0000000,,,,,-1.4000000
VQAGLQSGAKSQ,ph,S,567,true,"Tissue atlas Arabidopsis - ProteomicsDB",114,32188942,"MaxQuant score",257.1100000,1.0000000,,,,0,
