Peptide,PTM,ModifiedAA,ModifiedPosition,PeptideUniqueToGene,ExperimentDesc,ExpID,PubmedID,ScoreType,IdentScore,LocProb,Log2FChange,PQ-val,QuantSig,PEP,MassErrorPPM
TTTSVCPFSK,nt,T,2,true,"Arg/N-end rule seed, prt6 vs. Wt",99,29168982,"MASCOT Score",33.9200000,,-0.2717557,0.2657713,NO,0.00038410001434386,-0.7866428
TTTSVCPFSKAARPD,nta,T,2,true,"HUNTER N-terminome: legumain, GluC and trypsin",119,31951383,"MaxQuant score",,,,,,,
TTTSVCPFSK,nta,T,2,true,"Arg/N-end rule seed, prt6 vs. Wt",99,29168982,"MASCOT Score",33.9200000,,-0.4330008,0.0024905,NO,0.00038410001434386,-0.7866428
KQGEITASGCPFSK,ph,S,29,true,"Tissue atlas Arabidopsis - ProteomicsDB",114,32188942,"MaxQuant score",255.2300000,0.9997940,,,,0,
QGEITASGCPFSK,sno,C,31,true,"hot5-4 / wildtype, FAT-switch S-nitrosoproteome",169,37277371,,,,0.8281635,0.0037468,YES,,
QGETTASGCPFSK,sno,C,55,true,"hot5-4 / wildtype, FAT-switch S-nitrosoproteome",169,37277371,,,,0.2580056,0.2480764,NO,,
DSTDSATVPAK,ph,S,85,true,"Tissue atlas Arabidopsis - ProteomicsDB",114,32188942,"MaxQuant score",96.8200000,0.9655930,,,,0.00010717300028773,
CPFGYDSQTFK,ph,S,98,true,"srk2dei ABA signaling phopshoproteomics",83,23572148,"MASCOT Score",39.0000000,,,,,,-0.0003000
CPFGYDSQTFK,ph,T,100,true,"srk2dei ABA signaling phopshoproteomics",83,23572148,"MASCOT Score",51.0000000,,,,,,0.0003000
CPFGYDSQTFK,ph,T,100,true,"TOR Kinase and ABA Receptor",100,29290610,XCorr,3.8377390,0.9232000,,,,1.5850000636419E-5,
CPFGYDSQTFK,ph,T,100,true,"Tissue atlas Arabidopsis - ProteomicsDB",114,32188942,"MaxQuant score",244.2600000,1.0000000,,,,0,
AFSAQNYESAKSR,ac,K,219,true,"Quantitative Acetylproteomics",101,29440448,,,,,,,,
