Peptide,PTM,ModifiedAA,ModifiedPosition,PeptideUniqueToGene,ExperimentDesc,ExpID,PubmedID,ScoreType,IdentScore,LocProb,Log2FChange,PQ-val,QuantSig,PEP,MassErrorPPM
QQEWDNNSAPEGYGTQHDPNHR,ph,S,16,true,"Tissue atlas Arabidopsis - ProteomicsDB",114,32188942,"MaxQuant score",70.7180000,0.9696040,,,,2.9276400255185E-6,
SYDSEYER,ph,S,154,true,"atm and atr DNA damage response",88,25561503,"MASCOT Score",29.0000000,0.9930000,,,,,-0.4200000
SYDSEYER,ph,S,154,true,"Tissue atlas Arabidopsis - ProteomicsDB",114,32188942,"MaxQuant score",112.1100000,0.9999930,,,,0.0035360499750823,
SYDSEYER,ph,S,157,true,"atm and atr DNA damage response",88,25561503,"MASCOT Score",45.0000000,0.9450000,,,,,0.1600000
SYDSEYER,ph,S,157,true,"Tissue atlas Arabidopsis - ProteomicsDB",114,32188942,"MaxQuant score",152.5400000,1.0000000,,,,0.0016588299768046,
KSRDPQDR,ph,S,171,true,"atm and atr DNA damage response",88,25561503,"MASCOT Score",26.0000000,1.0000000,,,,,-0.2600000
ERDESPHKR,ph,S,205,true,"Tissue atlas Arabidopsis - ProteomicsDB",114,32188942,"MaxQuant score",76.3260000,1.0000000,,,,0.0020196500699967,
SYREDSYEGDHWNESER,ph,S,242,true,"Phospho cell culture sucrose/TOR",109,30833711,,,0.9997270,,,,,
EDSYEGDHWNESER,ph,S,242,true,"Tissue atlas Arabidopsis - ProteomicsDB",114,32188942,"MaxQuant score",344.9000000,1.0000000,,,,0,
TKDSPSADVGLSNSAAGK,ph,S,409,true,"Large-scale phosphorylation discovery",44,23111157,XCorr,4.1950000,,,,,,
TKDSPSADVGLSNSAAGK,ph,S,409,true,"Tissue atlas Arabidopsis - ProteomicsDB",114,32188942,"MaxQuant score",110.1800000,0.9861210,,,,3.3359299767E-9,
TKDSPSADVGLSNSAAGK,ph,S,411,true,"Large-scale phosphorylation discovery",44,23111157,XCorr,4.4680000,,,,,,
DSPSADVGLSNSAAGKR,ac,K,423,true,"Quantitative Acetylproteomics",101,29440448,,,,,,,,
VIISAATTPNVEK,ph,T,664,true,"Tissue atlas Arabidopsis - ProteomicsDB",114,32188942,"MaxQuant score",239.3800000,0.9689560,,,,0,
STSNHGVSALTTAESSSSSTTGGTLMGVMR,fuc,S,785,true,"SPINDLY O-fucosylation",162,36739885,,,,,,,0.74000000953674,
STSNHGVSALTTAESSSSSTTGGTLMGVMR,fuc,S,786,true,"SPINDLY O-fucosylation",162,36739885,,,,,,,0.25999999046326,
STSNHGVSALTTAESSSSSTTGGTLMGVMR,fuc,S,787,true,"SPINDLY O-fucosylation",162,36739885,,,,,,,1.5,
