Peptide,PTM,ModifiedAA,ModifiedPosition,PeptideUniqueToGene,ExperimentDesc,ExpID,PubmedID,ScoreType,IdentScore,LocProb,Log2FChange,PQ-val,QuantSig,PEP,MassErrorPPM
MEFSSQDDDFGGDDSAANATR,nta,M,1,true,"Characterization plant N-terminal acetylation",6,22223895,"MASCOT Score",131.0100000,,,,,,
MEFSSQDDDFGGDDSAANATR,nta,M,1,true,"Arg/N-end rule seed, prt6 vs. Wt",99,29168982,"MASCOT Score",50.5700000,,,,,0.014139999635518,-1.8691081
MEFSSQDDDFGGDDSAANATR,nta,M,1,true,"HUNTER N-terminome: legumain, GluC and trypsin",119,31951383,"MaxQuant score",106.1900000,,,,,,
MEFSSQDDDFGGDDSAANATR,nta,M,1,true,"Arabidopsis translation initiation landscape - NTA",167a,35069635,,,,,,,,
MEFSSQDDDF,nta,M,1,true,"N-term acetylation drought responses",5,26184543,,,,,,,,
MEFSSQDDDFGGDDSAANATR,ph,S,4,true,"Lateral root-induction - NAA vs control",106,23328941,"MASCOT Score",39.0000000,,,,,,
MEFSSQDDDFGGDDSAANATR,ph,S,5,true,"atm and atr DNA damage response",88,25561503,"MASCOT Score",64.0000000,0.9380000,,,,,-0.6100000
MEFSSQDDDFGGDDSAANATR,ph,S,5,true,"Lateral root-induction - NAA vs control",106,23328941,"MASCOT Score",49.0000000,,,,,,
SFGDLEDDEDDIFGSTTVAPGVR,ph,S,28,true,"srk2dei ABA signaling phopshoproteomics",83,23572148,"MASCOT Score",30.0000000,,,,,,-0.0026000
SFGDLEDDEDDIFGSTTVAPGVR,ph,S,28,true,"SnRK2 protein kinase substrates",85,23776212,XCorr,4.3875914,1.0000000,,,,3.9664799222905E-13,
SFGDLEDDEDDIFGSTTVAPGVR,ph,S,28,true,"TOR Kinase and ABA Receptor",100,29290610,XCorr,2.7899432,1.0000000,,,,6.5269996412098E-5,
SFGDLEDDEDDIFGSTTVAPGVR,ph,S,28,true,"Phospho cell culture sucrose/TOR",109,30833711,,,0.9922110,,,,,
SFGDLEDDEDDIFGSTTVAPGVR,ph,S,28,true,"Touch-induced phosphorylation: 40s touch vs untouc",136,30291188,"MASCOT score",136.6700000,,0.0013170,0.9922014,NO,,-1.2881559
SAFQNESFVPAGKSPEPR,ph,S,100,true,"srk2dei ABA signaling phopshoproteomics",83,23572148,"MASCOT Score",59.0000000,,,,,,0.0036000
SAFQNESFVPAGKSPEPR,ph,S,100,true,"TOR Kinase and ABA Receptor",100,29290610,XCorr,2.5960000,1.0000000,,,,0.00065080000786111,
SAFQNESFVPAGKSPEPR,ph,S,100,true,"Phospho cell culture sucrose/TOR",109,30833711,,,0.9984660,,,,,
SAFQNESFVPAGKSPEPR,ph,S,100,true,"Tissue atlas Arabidopsis - ProteomicsDB",114,32188942,"MaxQuant score",211.9800000,1.0000000,,,,0,
EQEMAELKSAVR,ub,K,149,true,"Arabidopsis ubiquitination COFRADIC",40,26744219,"MaxQuant Score",95.4170000,1.0000000,,,,2.8909998804675E-17,-0.1420000
ELQDNIAAVTFTPQSK,ph,T,206,true,"Tissue atlas Arabidopsis - ProteomicsDB",114,32188942,"MaxQuant score",203.9300000,0.8931350,,,,0,
