Peptide,PTM,ModifiedAA,ModifiedPosition,PeptideUniqueToGene,ExperimentDesc,ExpID,PubmedID,ScoreType,IdentScore,LocProb,Log2FChange,PQ-val,QuantSig,PEP,MassErrorPPM
AATAATTTSSHLLLSSSR,nta,A,2,true,"HUNTER N-terminome: legumain, GluC and trypsin",119,31951383,"MaxQuant score",123.0200000,,,,,,
HVASSSQPSILSPR,ph,S,31,true,"Tissue atlas Arabidopsis - ProteomicsDB",114,32188942,"MaxQuant score",140.8000000,0.9980540,,,,5.4835800256114E-6,
AVAADAAETKTAARKKSGY,nt,A,60,true,"Arabidopsis translation initiation landscape - NT",167b,35069635,,,,,,,,
AVAADAAETKTAAR,nt,A,60,true,"N-terminal ChaFRADIC",92,26010716,"MASCOT Score",47.2600000,,,,,5.5259999498958E-5,
AVAADAAETKTAAR,nt,A,60,true,"Stromal N-terminome",96,26371235,"MASCOT Score",121.4400000,,,,,,
AVAADAAETKTAAR,nt,A,60,true,"Arg/N-end rule seed, prt6 vs. Wt",99,29168982,"MASCOT Score",55.1000000,,,,,0.0022690000478178,-1.4700384
AVAADAAETKTAAR,nt,A,60,true,"FtsH12 N-terminome: WT / FtsH12 knockdown miRNA",118,33216923,"MaxQuant score",73.4350000,,0.7729990,0.0612230,NO,7.3600000177976E-5,
AVAADAAE,nt,A,60,true,"N-terminal ChaFRADIC",92,26010716,"MASCOT Score",64.5100000,,,,,0.019419999793172,
AVAADAAE,nt,A,60,true,"Arg/N-end rule seed, prt6 vs. Wt",99,29168982,"MASCOT Score",53.5400000,,0.1543468,0.2898617,NO,0.014059999957681,0.2978701
AVAADAAETKTAARKKSGY,nta,A,60,true,"Arabidopsis translation initiation landscape - NTA",167a,35069635,,,,,,,,
AVAADAAETKTAAR,nta,A,60,true,"N-terminal ChaFRADIC",92,26010716,"MASCOT Score",47.2600000,,,,,5.5259999498958E-5,
AVAADAAETKTAAR,nta,A,60,true,"Stromal N-terminome",96,26371235,"MASCOT Score",103.9000000,,,,,,
AVAADAAETKTAAR,nta,A,60,true,"Arg/N-end rule seed, prt6 vs. Wt",99,29168982,"MASCOT Score",55.1000000,,-0.3058740,0.0272291,NO,0.0022690000478178,-1.4700384
AVAADAAETKTAAR,nta,A,60,true,"FtsH12 N-terminome: WT / FtsH12 knockdown miRNA",118,33216923,"MaxQuant score",72.8010000,,-0.0436507,0.7874541,NO,0,
AVAADAAETKTAAR,nta,A,60,true,"HUNTER N-terminome: legumain, GluC and trypsin",119,31951383,"MaxQuant score",63.0910000,,,,,,
AVAADAAETK,nta,A,60,true,"Characterization plant N-terminal acetylation",6,22223895,"MASCOT Score",81.3000000,,,,,,
AVAADAAE,nta,A,60,true,"N-terminal ChaFRADIC",92,26010716,"MASCOT Score",54.4400000,,,,,0.054540000855923,
VAADAAETKTAAR,nt,V,61,true,"N-terminal ChaFRADIC",92,26010716,"MASCOT Score",36.6100000,,,,,0.00048479999531992,
VAADAAETKTAAR,nt,V,61,true,"Stromal N-terminome",96,26371235,"MASCOT Score",83.6700000,,,,,,
VAADAAETKTAAR,nt,V,61,true,"Arg/N-end rule seed, prt6 vs. Wt",99,29168982,"MASCOT Score",63.7900000,,,,,0.0010499999625608,-1.9255542
VAADAAETKTAAR,nta,V,61,true,"N-terminal ChaFRADIC",92,26010716,"MASCOT Score",36.6100000,,,,,0.00048479999531992,
VAADAAETKTAAR,nta,V,61,true,"Stromal N-terminome",96,26371235,"MASCOT Score",83.6700000,,,,,,
VAADAAETKTAAR,nta,V,61,true,"Arg/N-end rule seed, prt6 vs. Wt",99,29168982,"MASCOT Score",63.7900000,,-0.3387395,0.1172148,NO,0.0010499999625608,-1.9255542
VAADAAETKTAAR,nta,V,61,true,"Arabidopsis translation initiation landscape - NTA",167a,35069635,,,,,,,,
VAADAAETK,nta,V,61,true,"Characterization plant N-terminal acetylation",6,22223895,"MASCOT Score",69.7900000,,,,,,
LDVISNEVFSNCLR,acy,C,154,true,"Arabidopsis S-acylation atlas - Stem",163f,35681017,,,,,,,,
IVDDSDDISALGSEE,nt,I,216,true,"Arg/N-end rule seed, prt6 vs. Wt",99,29168982,"MASCOT Score",46.8800000,,-0.4314602,0.4523533,NO,0.0084149995818734,-1.2453368
IYSFNEGNYQMWDDKLK,ac,K,307,true,"Histone deacetylases substrates - hda14 vs WT",98e,29061669,"MaxQuant Score",42.6000000,1.0000000,0.0880000,0.9099133,NO,0.0010000000474975,
YIDDLKDPGPTGKPYSAR,ph,S,326,true,"Tissue atlas Arabidopsis - ProteomicsDB",114,32188942,"MaxQuant score",105.7200000,0.9808250,,,,1.157860012313E-7,
TLLYGGIYGYPR,nt,T,340,true,"N-terminal ChaFRADIC",92,26010716,"MASCOT Score",53.5100000,,,,,1.708999946004E-7,
YECAPMSFIVEQAGGKGSDGHSR,nt,Y,364,true,"N-terminal ChaFRADIC",92,26010716,"MASCOT Score",21.6900000,,,,,1.8199999374247E-7,
VLDIQPTEIHQR,nt,V,387,true,"Stromal N-terminome",96,26371235,"MASCOT Score",32.2800000,,,,,,
STEEVEKL,nt,S,405,true,"N-terminal ChaFRADIC",92,26010716,"MASCOT Score",25.6300000,,,,,0.022050000727177,
