Peptide,PTM,ModifiedAA,ModifiedPosition,PeptideUniqueToGene,ExperimentDesc,ExpID,PubmedID,ScoreType,IdentScore,LocProb,Log2FChange,PQ-val,QuantSig,PEP,MassErrorPPM
TTPQVKTGLFVGLN,nt,T,2,true,"Arg/N-end rule seed, prt6 vs. Wt",99,29168982,"MASCOT Score",44.3900000,,,,,0.013840000145137,3.9606008
TTPQVKTGLF,nt,T,2,true,"Arg/N-end rule seed, prt6 vs. Wt",99,29168982,"MASCOT Score",22.0200000,,-0.3667466,0.0661164,NO,0.032189998775721,-2.8658756
TTPQVKTGLFVGLNKGHVVTRRE,nta,T,2,true,"Arabidopsis translation initiation landscape - NTA",167a,35069635,,,,,,,,
TTPQVKTGLFVGLNKGHVVTR,nta,T,2,true,"Arg/N-end rule pathway Roots",80,25728785,"MASCOT Score",65.5800000,,,,,9.8800001069321E-6,
TTPQVKTGLFVGLN,nta,T,2,true,"Arg/N-end rule seed, prt6 vs. Wt",99,29168982,"MASCOT Score",44.3900000,,-0.1208525,0.8704860,NO,0.013840000145137,3.9606008
TTPQVKTGLF,nta,T,2,true,"Arg/N-end rule pathway Roots",80,25728785,"MASCOT Score",64.4300000,,,,,0.024189999327064,
KGKTSKR,ub,K,33,false,"Arabidopsis ubiquitination COFRADIC",40,26744219,"MaxQuant Score",76.6790000,0.9970000,,,,0.0049999998882413,-1.5230000
KGKTSKR,ub,K,35,false,"Arabidopsis ubiquitination COFRADIC",40,26744219,"MaxQuant Score",173.7300000,1.0000000,,,,0,0.2410000
KGKTSKR,ub,K,38,false,"Arabidopsis ubiquitination COFRADIC",40,26744219,"MaxQuant Score",173.7300000,1.0000000,,,,0,0.2410000
NLIKEVAGQAPYEKR,ub,K,48,false,"Arabidopsis ubiquitination COFRADIC",40,26744219,"MaxQuant Score",203.5200000,1.0000000,,,,0,0.4480000
EVAGQAPYEKR,ac,K,58,false,"Histone deacetylases - apicidin vs control",98a,29061669,"MaxQuant Score",54.3000000,1.0000000,-0.0940000,0.6902398,NO,0.010999999940395,
EVAGQAPYEKR,ac,K,58,false,"Quantitative Acetylproteomics",101,29440448,,,,,,,,
NLIKEVAGQAPYEKR,ub,K,58,false,"Arabidopsis ubiquitination COFRADIC",40,26744219,"MaxQuant Score",203.5200000,1.0000000,,,,0,0.4480000
KLGTHKR,ub,K,70,false,"Arabidopsis ubiquitination COFRADIC",40,26744219,"MaxQuant Score",107.9000000,1.0000000,,,,0.0020000000949949,-0.1310000
KLGTHKR,ub,K,75,false,"Arabidopsis ubiquitination COFRADIC",40,26744219,"MaxQuant Score",124.8300000,1.0000000,,,,0.0020000000949949,-0.0140000
KREEMSSVLR,ub,K,80,false,"Arabidopsis ubiquitination COFRADIC",40,26744219,"MaxQuant Score",65.6270000,1.0000000,,,,0.0099999997764826,-0.0050000
KREEMSSVLR,ph,S,86,false,"Tissue atlas Arabidopsis - ProteomicsDB",114,32188942,"MaxQuant score",89.4300000,0.8198090,,,,0.00069803802762181,
EEMSSVLR,ph,S,86,false,"atm and atr DNA damage response",88,25561503,"MASCOT Score",33.0000000,0.9340000,,,,,-0.0500000
SGGGGATEKKK,ub,K,101,true,"Arabidopsis ubiquitination COFRADIC",40,26744219,"MaxQuant Score",127.1700000,1.0000000,,,,4.0630001585384E-9,0.6740000
SGGGGATEKKK,ub,K,102,true,"Arabidopsis ubiquitination COFRADIC",40,26744219,"MaxQuant Score",127.1700000,1.0000000,,,,4.0630001585384E-9,0.6740000
SGGGGATEKKK,ub,K,103,true,"Arabidopsis ubiquitination COFRADIC",40,26744219,"MaxQuant Score",185.2500000,1.0000000,,,,0,-1.0610000
