Peptide,PTM,ModifiedAA,ModifiedPosition,PeptideUniqueToGene,ExperimentDesc,ExpID,PubmedID,ScoreType,IdentScore,LocProb,Log2FChange,PQ-val,QuantSig,PEP,MassErrorPPM
PFNITSVK,ng,N,4,true,"Conserved N-glycosylation",74,22633491,"MaxQuant Score",103.0300000,1.0000000,,,,0.0099999997764826,-1.1900000
DLSASQDSTKEELR,ph,S,448,true,"atm and atr DNA damage response",88,25561503,"MASCOT Score",26.0000000,0.9930000,,,,,-0.7400000
DLSASQDSTKEELR,ph,S,448,true,"Tissue atlas Arabidopsis - ProteomicsDB",114,32188942,"MaxQuant score",113.4700000,0.9994330,,,,0.00011474500206532,
LKDLSASQDSTK,ph,S,448,true,"atm and atr DNA damage response",88,25561503,"MASCOT Score",41.0000000,0.9300000,,,,,-1.3200000
DLSASQDSTKEELR,ph,S,450,true,"atm and atr DNA damage response",88,25561503,"MASCOT Score",41.0000000,1.0000000,,,,,-0.0600000
DLSASQDSTKEELR,ph,S,450,true,"Tissue atlas Arabidopsis - ProteomicsDB",114,32188942,"MaxQuant score",153.9400000,0.9993060,,,,2.5748500220857E-8,
DLSASQDSTKEELR,ph,S,453,true,"atm and atr DNA damage response",88,25561503,"MASCOT Score",49.0000000,0.9360000,,,,,0.0100000
DLSASQDSTKEELR,ph,S,453,true,"Tissue atlas Arabidopsis - ProteomicsDB",114,32188942,"MaxQuant score",152.2500000,0.8173490,,,,2.3265100423941E-7,
STAVTLRPAPSK,ph,S,702,true,"atm and atr DNA damage response",88,25561503,"MASCOT Score",27.0000000,0.9990000,,,,,-0.3900000
STAVTLRPAPSK,ph,S,702,true,"TOR Kinase and ABA Receptor",100,29290610,XCorr,2.0744696,0.9643000,,,,0.014109999872744,
AHVEDITVSK,ph,T,824,true,"Tissue atlas Arabidopsis - ProteomicsDB",114,32188942,"MaxQuant score",115.1400000,0.9984660,,,,0.00051214901031926,
AHVEDITVSK,ph,S,826,true,"Tissue atlas Arabidopsis - ProteomicsDB",114,32188942,"MaxQuant score",124.2100000,0.9990820,,,,0.00010082899825647,
