Peptide,PTM,ModifiedAA,ModifiedPosition,PeptideUniqueToGene,ExperimentDesc,ExpID,PubmedID,ScoreType,IdentScore,LocProb,Log2FChange,PQ-val,QuantSig,PEP,MassErrorPPM
SSFNGNSNIDNLLIQTLLGR,nta,S,2,true,"Arabidopsis translation initiation landscape - NTA",167a,35069635,,,,,,,,
SDDSDGDDDGEGQTSLDREEAR,ph,S,43,true,"TOR Kinase and ABA Receptor",100,29290610,XCorr,2.3370993,1.0000000,,,,0.0023459999356419,
SDDSDGDDDGEGQTSLDREEARLEK,ph,S,46,true,"TOR Kinase and ABA Receptor",100,29290610,XCorr,3.5583899,0.9653000,,,,0.0016499999910593,
SDDSDGDDDGEGQTSLDREEAR,ph,S,46,true,"srk2dei ABA signaling phopshoproteomics",83,23572148,"MASCOT Score",95.0000000,,,,,,-0.0020000
SDDSDGDDDGEGQTSLDREEAR,ph,S,46,true,"TOR Kinase and ABA Receptor",100,29290610,XCorr,3.7861955,0.9990000,,,,4.6420001353908E-7,
SDDSDGDDDGEGQTSLDREEAR,ph,S,46,true,"Col-0 callus - FC Col-0 vs. Col-0 Xray",111a,31410901,,48.5300000,,-0.2226170,0.0000000,NO,,0.8789457
SDDSDGDDDGEGQTSLDREEAR,ph,S,46,true,"Col-0 X-ray callus - FC Col-0 vs. Col-0 Xray",111b,31410901,,48.5300000,,-0.2226170,0.0000000,NO,,0.8789457
SDDSDGDDDGEGQTSLDREEAR,ph,S,46,true,"atm callus - FC atm vs. atm Xray",111c,31410901,,48.5300000,,-0.5674618,0.0000000,NO,,0.8789457
SDDSDGDDDGEGQTSLDREEAR,ph,S,46,true,"atm-3 X-ray callus - FC atm vs. atm Xray",111d,31410901,,48.5300000,,-0.5674618,0.0000000,NO,,0.8789457
SDDSDGDDDGEGQTSLDR,ph,S,46,true,"LAXIC - mannitol vs control",84b,23660473,XCorr,5.6200000,0.9970000,,,,4.1800001273948E-16,
SDDSDGDDDGEGQTSLDR,ph,S,46,true,"atm and atr DNA damage response",88,25561503,"MASCOT Score",88.0000000,1.0000000,,,,,-1.5500000
