Peptide,PTM,ModifiedAA,ModifiedPosition,PeptideUniqueToGene,ExperimentDesc,ExpID,PubmedID,ScoreType,IdentScore,LocProb,Log2FChange,PQ-val,QuantSig,PEP,MassErrorPPM
VAVSSDFEVEEDDMFADGDDSAPVERN,nt,V,67,true,"HUNTER N-terminome: legumain, GluC and trypsin",119,31951383,"MaxQuant score",66.7930000,,,,,,
VAVSSDFEVEEDDMFADGDDSAPVER,nt,V,67,true,"Stromal N-terminome",96,26371235,"MASCOT Score",56.3500000,,,,,,
VAVSSDFEVEEDDMFADGDDSAPVER,nt,V,67,true,"Arg/N-end rule seed, prt6 vs. Wt",99,29168982,"MASCOT Score",61.2600000,,0.6917815,0.1253496,NO,0.0024530000519007,-1.3791852
VAVSSDFEVEEDDMFADGDDSAPVER,nt,V,67,true,"HUNTER N-terminome: legumain, GluC and trypsin",119,31951383,"MaxQuant score",90.6330000,,,,,,
VAVSSDFEVEE,nt,V,67,true,"HUNTER N-terminome: legumain, GluC and trypsin",119,31951383,"MaxQuant score",105.1400000,,,,,,
VAVSSDFE,nt,V,67,true,"Arg/N-end rule seed, prt6 vs. Wt",99,29168982,"MASCOT Score",45.2400000,,0.4558530,0.2818335,NO,0.021460000425577,0.6072155
VAVSSDFE,nt,V,67,true,"HUNTER N-terminome: legumain, GluC and trypsin",119,31951383,"MaxQuant score",105.2000000,,,,,,
VAVSSDFEVEEDDMFADGDDSAPVER,nta,V,67,true,"Stromal N-terminome",96,26371235,"MASCOT Score",56.3500000,,,,,,
VAVSSDFEVEEDDMFADGDDSAPVER,nta,V,67,true,"Arg/N-end rule seed, prt6 vs. Wt",99,29168982,"MASCOT Score",37.0800000,,,,,0.059179998934269,-3.7209022
AVSSDFEVEEDDMFADGDDSAPVER,nt,A,68,true,"Arg/N-end rule seed, prt6 vs. Wt",99,29168982,"MASCOT Score",56.7200000,,,,,0.0084260003641248,-3.1677534
NSFSPDLK,ph,S,94,true,"atm and atr DNA damage response",88,25561503,"MASCOT Score",34.0000000,1.0000000,,,,,-1.7100000
NSFSPDLK,ph,S,94,true,"Tissue atlas Arabidopsis - ProteomicsDB",114,32188942,"MaxQuant score",91.2150000,0.9993940,,,,0.0066408701241016,
NSFSPDLK,ph,S,96,true,"Tissue atlas Arabidopsis - ProteomicsDB",114,32188942,"MaxQuant score",101.1200000,0.9999920,,,,0.0049391300417483,
SAQLAQLFE,nt,S,112,false,"Arg/N-end rule seed, prt6 vs. Wt",99,29168982,"MASCOT Score",28.5900000,,,,,0.035719998180866,0.2250161
VNAGPPPPKR,ac,K,180,false,"Quantitative Acetylproteomics",101,29440448,,,,,,,,
REESFSR,ph,S,184,true,"STN8 phosphoproteome",38,21768351,"MASCOT Score",45.1700000,,,,,,0.6925660
REESFSR,ph,S,184,true,"Chloroplast kinase substrates",60,19376835,"MASCOT Score",33.6500000,,,,,,-0.0134983
REESFSR,ph,S,184,true,"Tissue atlas Arabidopsis - ProteomicsDB",114,32188942,"MaxQuant score",107.4500000,0.9998890,,,,0.00011954100045841,
REESFSRGPR,ph,S,186,true,"Tissue atlas Arabidopsis - ProteomicsDB",114,32188942,"MaxQuant score",55.7240000,0.9625770,,,,0.0075030499137938,
GGGYGSERGGGYGSER,ph,S,204,true,"TOR Kinase and ABA Receptor",100,29290610,XCorr,2.1480825,0.8450000,,,,0.016200000420213,
GGGYGSERGGGYGSER,ph,S,212,true,"TOR Kinase and ABA Receptor",100,29290610,XCorr,2.1480825,0.8450000,,,,0.016200000420213,
SSYGSGSGSGSGSGSGNR,ph,S,242,true,"atm and atr DNA damage response",88,25561503,"MASCOT Score",90.0000000,0.9250000,,,,,0.3400000
SSYGSGSGSGSGSGSGNR,ph,S,245,true,"atm and atr DNA damage response",88,25561503,"MASCOT Score",114.0000000,0.9940000,,,,,0.2700000
