Peptide,PTM,ModifiedAA,ModifiedPosition,PeptideUniqueToGene,ExperimentDesc,ExpID,PubmedID,ScoreType,IdentScore,LocProb,Log2FChange,PQ-val,QuantSig,PEP,MassErrorPPM
AKDVEAVPGEGFQTRDYQDPPPAPFID,nt,A,2,true,"HUNTER N-terminome: legumain, GluC and trypsin",119,31951383,"MaxQuant score",122.0400000,,,,,,
AKDVEAVPGEGFQTRDYQD,nt,A,2,true,"HUNTER N-terminome: legumain, GluC and trypsin",119,31951383,"MaxQuant score",98.5430000,,,,,,
AKDVEAVPGEGFQTRD,nt,A,2,true,"HUNTER N-terminome: legumain, GluC and trypsin",119,31951383,"MaxQuant score",129.4200000,,,,,,
AKDVEAVPGEGFQTR,nt,A,2,true,"Arg/N-end rule pathway Roots",80,25728785,"MASCOT Score",93.6500000,,,,,1.6590000484484E-7,
AKDVEAVPGEGFQTR,nt,A,2,true,"N-terminal ChaFRADIC",92,26010716,"MASCOT Score",50.8000000,,,,,3.5800001114694E-6,
AKDVEAVPGEGFQTR,nt,A,2,true,"Stromal N-terminome",96,26371235,"MASCOT Score",59.1900000,,,,,,
AKDVEAVPGEGFQTR,nt,A,2,true,"Arg/N-end rule seed, prt6 vs. Wt",99,29168982,"MASCOT Score",51.1400000,,0.2517085,0.2128636,NO,0.00014980000560172,-1.0395883
AKDVEAVPGEGFQTR,nt,A,2,true,"HUNTER N-terminome: legumain, GluC and trypsin",119,31951383,"MaxQuant score",161.0400000,,,,,,
AKDVEAVPGEGF,nt,A,2,true,"N-terminal ChaFRADIC",92,26010716,"MASCOT Score",32.9400000,,,,,0.0027880000416189,
AKDVEAVPGEGF,nt,A,2,true,"Arg/N-end rule seed, prt6 vs. Wt",99,29168982,"MASCOT Score",45.7700000,,0.1193057,0.5655548,NO,0.010019999928772,-1.7245860
AKDVEAVPGE,nt,A,2,true,"N-term acetylation drought responses",5,26184543,,,,,,,,
AKDVEAVPGE,nt,A,2,true,"N-terminal ChaFRADIC",92,26010716,"MASCOT Score",54.4300000,,,,,0.027809999883175,
AKDVEAVPG,nt,A,2,true,"N-terminal ChaFRADIC",92,26010716,"MASCOT Score",50.6900000,,,,,0.043010000139475,
AKDVEAVPGEGFQTRDYQDPPPAPFID,nta,A,2,true,"HUNTER N-terminome: legumain, GluC and trypsin",119,31951383,"MaxQuant score",,,,,,,
AKDVEAVPGEGFQTRD,nta,A,2,true,"HUNTER N-terminome: legumain, GluC and trypsin",119,31951383,"MaxQuant score",50.8970000,,,,,,
AKDVEAVPGEGFQTR,nta,A,2,true,"Arg/N-end rule pathway Roots",80,25728785,"MASCOT Score",64.2200000,,,,,2.3299999156734E-5,
AKDVEAVPGEGFQTR,nta,A,2,true,"N-terminal ChaFRADIC",92,26010716,"MASCOT Score",50.8000000,,,,,3.5800001114694E-6,
AKDVEAVPGEGFQTR,nta,A,2,true,"Stromal N-terminome",96,26371235,"MASCOT Score",59.1900000,,,,,,
AKDVEAVPGEGFQTR,nta,A,2,true,"Arg/N-end rule seed, prt6 vs. Wt",99,29168982,"MASCOT Score",51.1400000,,0.3160737,0.1704505,NO,0.00014980000560172,-1.0395883
AKDVEAVPGEGFQTR,nta,A,2,true,"FtsH12 N-terminome: WT / FtsH12 knockdown miRNA",118,33216923,"MaxQuant score",164.7200000,,,,,3.8700000645957E-18,
AKDVEAVPGEGFQTR,nta,A,2,true,"HUNTER N-terminome: legumain, GluC and trypsin",119,31951383,"MaxQuant score",114.7600000,,,,,,
AKDVEAVPGEGF,nta,A,2,true,"N-terminal ChaFRADIC",92,26010716,"MASCOT Score",32.9400000,,,,,0.0027880000416189,
AKDVEAVPGEGF,nta,A,2,true,"Arg/N-end rule seed, prt6 vs. Wt",99,29168982,"MASCOT Score",34.6200000,,0.2937258,0.0982436,NO,0.058380000293255,-1.3520568
AKDVEAVPGE,nta,A,2,true,"N-terminal ChaFRADIC",92,26010716,"MASCOT Score",54.4300000,,,,,0.027809999883175,
AKDVEAVPG,nta,A,2,true,"N-terminal ChaFRADIC",92,26010716,"MASCOT Score",50.6900000,,,,,0.043010000139475,
AKDVEAVPGEGFQTR,ub,K,3,true,"Ubiquitination Membrane Proteins",120,33585938,,,,,,,,
AKDVEAVPGEGFQTR,ub,K,3,true,"upl3 mutant / wildtype",168,35926874,"MaxQuant score",118.2100000,1.0000000,0.8836208,0.3089000,NO,1.2760200007733E-8,1.4582000
DVEAVPGEGFQTR,nt,D,4,true,"N-terminal ChaFRADIC",92,26010716,"MASCOT Score",22.9400000,,,,,7.0239999331534E-5,
VEAVPGEGFQTR,nt,V,5,true,"Metacaspase9 substrates - 35S:MC9 / mc9",51b,23964026,"MASCOT Score",69.0000000,,3.5931161,,NO,,-1.2475250
DVEAVPGEGFQTR,ph,T,15,true,"Tissue atlas Arabidopsis - ProteomicsDB",114,32188942,"MaxQuant score",99.9270000,1.0000000,,,,0.00060496397782117,
DYQDPPPAPF,nt,D,17,true,"N-terminal ChaFRADIC",92,26010716,"MASCOT Score",47.5100000,,,,,1.1559999620658E-5,
DYQDPPPAPFIDGAELKK,ac,K,33,true,"Quantitative Acetylproteomics",101,29440448,,,,,,,,
TIPITGTGINPAR,nt,T,219,false,"Arg/N-end rule seed, prt6 vs. Wt",99,29168982,"MASCOT Score",59.1200000,,,,,0.0047100000083447,-0.2771244
ASGSKSLGSFR,ac,K,276,false,"Quantitative Acetylproteomics",101,29440448,,,,,,,,
ASGSKSLGSFR,ub,K,276,false,"upl3 mutant / wildtype",168,35926874,"MaxQuant score",135.1000000,1.0000000,0.9373444,0.2580600,NO,1.8376500321438E-8,1.1775000
SLGSFRSAANV,ph,S,277,false,"Phosphoproteome ethylene-regulated time response",46,24043427,"MASCOT Score",23.9700000,,,,,,15.4528000
ASGSKSLGSFRSAANV,ph,S,280,false,"Plasmembrane Ph Immune Responses",25,17651370,,,,,,,,
SLGSFRSAANV,ph,S,280,false,"Arabidopsis root NAA phosphoproteome",18a,27643528,"MaxQuant Score",88.5360000,1.0000000,,,,4.9589998525335E-6,0.1300000
SLGSFRSAANV,ph,S,280,false,"Plasmamembrane phosphorylation",20,15308754,,,,,,,,
SLGSFRSAANV,ph,S,280,false,"Sucrose-induced phosphorylation",24,17586839,,,,,,,,
SLGSFRSAANV,ph,S,280,false,"Plasmembrane Ph Immune Responses",25,17651370,,,,,,,,
SLGSFRSAANV,ph,S,280,false,"ABA-induced protein phosphorylation",35,20733066,,,,,,,,
SLGSFRSAANV,ph,S,280,false,"Phosphoproteome ethylene-regulated time response",46,24043427,"MASCOT Score",59.3100000,,,,,,11.1283000
SLGSFRSAANV,ph,S,280,false,"srk2dei ABA signaling phopshoproteomics",83,23572148,"MASCOT Score",49.0000000,,,,,,0.0002000
SLGSFRSAANV,ph,S,280,false,"LAXIC - ABA stress",84a,23660473,XCorr,3.5200000,1.0000000,,,,0.040231101214886,
SLGSFRSAANV,ph,S,280,false,"SnRK2 protein kinase substrates",85,23776212,XCorr,3.6460984,1.0000000,,,,0.00013698199472856,
SLGSFRSAANV,ph,S,280,false,"SIRK1 phosphorylation",86a,23820729,"MaxQuant Score",156.9300000,1.0000000,,,,0.00083319999976084,-0.0130000
SLGSFRSAANV,ph,S,280,false,"atm and atr DNA damage response",88,25561503,"MASCOT Score",61.0000000,1.0000000,,,,,-1.4900000
SLGSFRSAANV,ph,S,280,false,"Brassinosteroid-Regulated Phosphorylation Dynamics",94,26187819,"MaxQuant Score",133.2500000,1.0000000,,,,0.0020000000949949,0.6130000
SLGSFRSAANV,ph,S,280,false,"TOR Kinase and ABA Receptor",100,29290610,XCorr,3.8104451,0.9884000,,,,0.010119999758899,
SLGSFRSAANV,ph,S,280,false,"Phosphorylation tonoplast membrane fraction",107,18686298,"MASCOT Score",27.0000000,,,,,,
SLGSFRSAANV,ph,S,280,false,"Phospho cell culture sucrose/TOR",109,30833711,,,0.9999040,,,,,
SLGSFRSAANV,ph,S,280,false,"Tissue atlas Arabidopsis - ProteomicsDB",114,32188942,"MaxQuant score",129.1700000,0.9999990,,,,4.9995701374428E-6,
SLGSFR,ph,S,280,false,"Sucrose-induced phosphorylation",24,17586839,,,,,,,,
SLGSFR,ph,S,280,false,"srk2dei ABA signaling phopshoproteomics",83,23572148,"MASCOT Score",31.0000000,,,,,,0.0006000
SLGSFR,ph,S,280,false,"Col-0 callus - FC Col-0 vs. Col-0 Xray",111a,31410901,,21.1000000,,-0.0932616,0.0000000,NO,,0.2091535
SLGSFR,ph,S,280,false,"Col-0 X-ray callus - FC Col-0 vs. Col-0 Xray",111b,31410901,,21.1000000,,-0.0932616,0.0000000,NO,,0.2091535
SLGSFR,ph,S,280,false,"atm callus - FC atm vs. atm Xray",111c,31410901,,21.1000000,,-0.6688851,0.0000000,NO,,0.2091535
SLGSFR,ph,S,280,false,"atm-3 X-ray callus - FC atm vs. atm Xray",111d,31410901,,21.1000000,,-0.6688851,0.0000000,NO,,0.2091535
LGSFR,ph,S,280,false,"Tyrosine phosphorylation in Arabidopsis",59,18463617,"MASCOT Score",37.0000000,,,,,,-0.7595512
LGSFR,ph,S,280,false,"srk2dei ABA signaling phopshoproteomics",83,23572148,"MASCOT Score",37.0000000,,,,,,-0.0004000
ASGSKSLGSFRSAANV,ph,S,283,false,"Plasmembrane Ph Immune Responses",25,17651370,,,,,,,,
SLGSFRSAANV,ph,S,283,false,"Arabidopsis root NAA phosphoproteome",18a,27643528,"MaxQuant Score",88.5360000,1.0000000,,,,4.9589998525335E-6,0.1300000
SLGSFRSAANV,ph,S,283,false,"Plasmamembrane phosphorylation",20,15308754,,,,,,,,
SLGSFRSAANV,ph,S,283,false,"Sucrose-induced phosphorylation",24,17586839,,,,,,,,
SLGSFRSAANV,ph,S,283,false,"Plasmembrane Ph Immune Responses",25,17651370,,,,,,,,
SLGSFRSAANV,ph,S,283,false,"ABA-induced protein phosphorylation",35,20733066,,,,,,,,
SLGSFRSAANV,ph,S,283,false,"Phosphoproteome ethylene-regulated time response",46,24043427,"MASCOT Score",59.3100000,,,,,,11.1283000
SLGSFRSAANV,ph,S,283,false,"srk2dei ABA signaling phopshoproteomics",83,23572148,"MASCOT Score",49.0000000,,,,,,0.0003000
SLGSFRSAANV,ph,S,283,false,"LAXIC - ABA stress",84a,23660473,XCorr,3.5200000,1.0000000,,,,0.040231101214886,
SLGSFRSAANV,ph,S,283,false,"SnRK2 protein kinase substrates",85,23776212,XCorr,3.6460984,1.0000000,,,,0.00013698199472856,
SLGSFRSAANV,ph,S,283,false,"SIRK1 phosphorylation",86a,23820729,"MaxQuant Score",156.9300000,1.0000000,,,,0.00083319999976084,-0.0130000
SLGSFRSAANV,ph,S,283,false,"SIRK1 exp - sirk1 mutant vs WT",86b,23820729,,,,-2.8229288,,NO,,
SLGSFRSAANV,ph,S,283,false,"SIRK1 exp - 35S:SIRK1 vs WT",86c,23820729,,,,-0.6893417,,NO,,
SLGSFRSAANV,ph,S,283,false,"atm and atr DNA damage response",88,25561503,"MASCOT Score",61.0000000,1.0000000,,,,,-1.4900000
SLGSFRSAANV,ph,S,283,false,"Brassinosteroid-Regulated Phosphorylation Dynamics",94,26187819,"MaxQuant Score",133.2500000,1.0000000,,,,0.0020000000949949,0.6130000
SLGSFRSAANV,ph,S,283,false,"TOR Kinase and ABA Receptor",100,29290610,XCorr,4.1008034,1.0000000,,,,0.0065330001525581,
SLGSFRSAANV,ph,S,283,false,"Phosphorylation tonoplast membrane fraction",107,18686298,"MASCOT Score",27.0000000,,,,,,
SLGSFRSAANV,ph,S,283,false,"Phospho cell culture sucrose/TOR",109,30833711,,,0.9999960,,,,,
SLGSFRSAANV,ph,S,283,false,"Tissue atlas Arabidopsis - ProteomicsDB",114,32188942,"MaxQuant score",129.1700000,1.0000000,,,,4.9995701374428E-6,
