Peptide,PTM,ModifiedAA,ModifiedPosition,PeptideUniqueToGene,ExperimentDesc,ExpID,PubmedID,ScoreType,IdentScore,LocProb,Log2FChange,PQ-val,QuantSig,PEP,MassErrorPPM
SDSFASEIIK,ph,S,352,true,"Plasmamembrane phosphorylation",20,15308754,,,,,,,,
SDSFASEIIK,ph,S,352,true,"Phosphorylation Early Elicitor Signaling",23,17317660,,,,,,,,
SDSFASEIIK,ph,S,352,true,"LAXIC - ABA stress",84a,23660473,XCorr,2.4500000,0.9660000,,,,0.1119479984045,
SDSFASEIIK,ph,S,352,true,"atm and atr DNA damage response",88,25561503,"MASCOT Score",47.0000000,0.9970000,,,,,-1.0900000
SDSFASEIIK,ph,S,352,true,"Tissue atlas Arabidopsis - ProteomicsDB",114,32188942,"MaxQuant score",164.6000000,0.9999950,,,,3.574679965368E-7,
SDSFASEIIK,ph,S,355,true,"Plasmamembrane phosphorylation",20,15308754,,,,,,,,
SDSFASEIIK,ph,S,355,true,"atm and atr DNA damage response",88,25561503,"MASCOT Score",45.0000000,1.0000000,,,,,-1.1300000
SDSFASEIIK,ph,S,355,true,"Tissue atlas Arabidopsis - ProteomicsDB",114,32188942,"MaxQuant score",164.8100000,1.0000000,,,,3.4487101174818E-7,
AGTKNFNESR,ub,K,374,true,"Ubiquitination Membrane Proteins",120,33585938,,,,,,,,
SSSWSVPEHNVIIR,ph,S,695,true,"Tissue atlas Arabidopsis - ProteomicsDB",114,32188942,"MaxQuant score",172.1000000,0.8561100,,,,7.9957602056025E-16,
SSSWSVPEHNVIIR,ph,S,697,true,"Tissue atlas Arabidopsis - ProteomicsDB",114,32188942,"MaxQuant score",155.0900000,0.9758270,,,,2.554839950708E-10,
