Peptide,PTM,ModifiedAA,ModifiedPosition,PeptideUniqueToGene,ExperimentDesc,ExpID,PubmedID,ScoreType,IdentScore,LocProb,Log2FChange,PQ-val,QuantSig,PEP,MassErrorPPM
GTDSYGVTTGFGATSHR,ph,T,113,false,"Tissue atlas Arabidopsis - ProteomicsDB",114,32188942,"MaxQuant score",101.4800000,0.9280870,,,,3.9409201235685E-7,
TKNGTALQTELIR,ub,K,124,true,"Ubiquitination Membrane Proteins",120,33585938,,,,,,,,
TKNGTALQTELIR,ub,K,124,true,"upl3 mutant / wildtype",168,35926874,"MaxQuant score",82.2020000,1.0000000,1.4038131,,,5.4660398745909E-5,0.5579900
ETCHTLPQSATR,sno,C,149,true,"hot5-4 / wildtype, FAT-switch S-nitrosoproteome",169,37277371,,,,,,,,
ATGPDGESLTAKEAFEK,ub,K,236,true,"upl3 mutant / wildtype",168,35926874,"MaxQuant score",52.1720000,1.0000000,0.7198406,0.4051600,NO,0.00082612398546189,-0.0795890
QATKSIER,ac,K,373,true,"Quantitative Acetylproteomics",101,29440448,,,,,,,,
AIHGGNFQGTPIGVSMDNTR,ph,T,404,false,"Tissue atlas Arabidopsis - ProteomicsDB",114,32188942,"MaxQuant score",111.4000000,0.9999900,,,,8.9668003924737E-12,
QTVKNTVSQVAK,ac,K,538,false,"Quantitative Acetylproteomics",101,29440448,,,,,,,,
NTVSQVAKK,ac,K,546,false,"Quantitative Acetylproteomics",101,29440448,,,,,,,,
AVLPKEVEAAR,ub,K,633,false,"Ubiquitination Membrane Proteins",120,33585938,,,,,,,,
AVLPKEVEAAR,ub,K,633,false,"upl3 mutant / wildtype",168,35926874,"MaxQuant score",133.8100000,1.0000000,1.9759970,0.1160830,NO,4.4084798034305E-9,-0.5093400
