Peptide,PTM,ModifiedAA,ModifiedPosition,PeptideUniqueToGene,ExperimentDesc,ExpID,PubmedID,ScoreType,IdentScore,LocProb,Log2FChange,PQ-val,QuantSig,PEP,MassErrorPPM
TLLEDKR,ac,K,268,true,"Quantitative Acetylproteomics",101,29440448,,,,,,,,
LNIDTDSSSPQNIISPK,ph,T,394,true,"srk2dei ABA signaling phopshoproteomics",83,23572148,"MASCOT Score",43.0000000,,,,,,-0.0006000
LNIDTDSSSPQNIISPK,ph,S,396,true,"Conserved plant phosphoproteome - Arabidopsis",61a,20466843,"MASCOT Score",78.0000000,1.0000000,,,,,
LNIDTDSSSPQNIISPK,ph,S,397,true,"Lateral root-induction - NAA vs control",106,23328941,"MASCOT Score",37.0000000,,,,,,
LNIDTDSSSPQNIISPK,ph,S,398,true,"ABA-induced protein phosphorylation",35,20733066,,,,,,,,
LNIDTDSSSPQNIISPK,ph,S,398,true,"Large-scale phosphorylation discovery",44,23111157,XCorr,5.6680000,,,,,,
LNIDTDSSSPQNIISPK,ph,S,398,true,"srk2dei ABA signaling phopshoproteomics",83,23572148,"MASCOT Score",90.0000000,,,,,,0.0004000
LNIDTDSSSPQNIISPK,ph,S,398,true,"LAXIC - mannitol vs control",84b,23660473,XCorr,6.2900000,0.9990000,,,,2.669999958016E-6,
LNIDTDSSSPQNIISPK,ph,S,398,true,"SnRK2 protein kinase substrates",85,23776212,XCorr,3.7110870,0.9990000,,,,1.4378299939555E-10,
LNIDTDSSSPQNIISPK,ph,S,398,true,"TOR Kinase and ABA Receptor",100,29290610,XCorr,2.5550821,0.8593000,,,,0.011339999735355,
LNIDTDSSSPQNIISPK,ph,S,398,true,"Lateral root-induction - NAA vs control",106,23328941,"MASCOT Score",106.0000000,,0.2075086,0.4396507,NO,,
LNIDTDSSSPQNIISPK,ph,S,398,true,"Phospho cell culture sucrose/TOR",109,30833711,,,0.9995990,,,,,
LNIDTDSSSPQNIISPK,ph,S,398,true,"Col-0 callus - FC Col-0 vs. Col-0 Xray",111a,31410901,,60.7000000,,1.3120704,0.0236316,YES,,0.7728924
LNIDTDSSSPQNIISPK,ph,S,398,true,"Col-0 X-ray callus - FC Col-0 vs. Col-0 Xray",111b,31410901,,60.7000000,,1.3120704,0.0236316,YES,,0.7728924
LNIDTDSSSPQNIISPK,ph,S,398,true,"atm callus - FC atm vs. atm Xray",111c,31410901,,60.7000000,,1.5601311,0.0466189,YES,,0.7728924
LNIDTDSSSPQNIISPK,ph,S,398,true,"atm-3 X-ray callus - FC atm vs. atm Xray",111d,31410901,,60.7000000,,1.5601311,0.0466189,YES,,0.7728924
LNIDTDSSSPQNIISPK,ph,S,398,true,"Tissue atlas Arabidopsis - ProteomicsDB",114,32188942,"MaxQuant score",404.0400000,0.9994480,,,,0,
LNIDTDSSSPQNIISPK,ph,S,404,true,"Arabidopsis root NAA phosphoproteome",18a,27643528,"MaxQuant Score",115.8700000,1.0000000,,,,3.4300000320299E-17,-0.4840000
LNIDTDSSSPQNIISPK,ph,S,404,true,"Phosphorylation nuclei-enriched fractions",28,19245862,,,,,,,,
LNIDTDSSSPQNIISPK,ph,S,404,true,"ABA-induced protein phosphorylation",35,20733066,,,,,,,,
LNIDTDSSSPQNIISPK,ph,S,404,true,"STN8 phosphoproteome",38,21768351,"MASCOT Score",111.1700000,,,,,,-2.5526900
LNIDTDSSSPQNIISPK,ph,S,404,true,"Tyrosine phosphorylation in Arabidopsis",59,18463617,"MASCOT Score",81.0000000,,,,,,-0.8386245
LNIDTDSSSPQNIISPK,ph,S,404,true,"Chloroplast kinase substrates",60,19376835,"MASCOT Score",85.6400000,,,,,,-1.1180600
LNIDTDSSSPQNIISPK,ph,S,404,true,"srk2dei ABA signaling phopshoproteomics",83,23572148,"MASCOT Score",97.0000000,,,,,,-0.0006000
LNIDTDSSSPQNIISPK,ph,S,404,true,"LAXIC - ABA stress",84a,23660473,XCorr,5.9000000,1.0000000,,,,8.6200002691328E-10,
LNIDTDSSSPQNIISPK,ph,S,404,true,"LAXIC - mannitol vs control",84b,23660473,XCorr,6.2900000,1.0000000,,,,2.669999958016E-6,
LNIDTDSSSPQNIISPK,ph,S,404,true,"SnRK2 protein kinase substrates",85,23776212,XCorr,4.4738302,1.0000000,,,,0.00010012699931394,
LNIDTDSSSPQNIISPK,ph,S,404,true,"atm and atr DNA damage response",88,25561503,"MASCOT Score",49.0000000,1.0000000,,,,,-0.1200000
LNIDTDSSSPQNIISPK,ph,S,404,true,"TOR Kinase and ABA Receptor",100,29290610,XCorr,5.8361144,1.0000000,,,,1.0459999977286E-8,
LNIDTDSSSPQNIISPK,ph,S,404,true,"Lateral root-induction - NAA vs control",106,23328941,"MASCOT Score",55.0000000,,0.1159216,0.6940662,NO,,
LNIDTDSSSPQNIISPK,ph,S,404,true,"Phospho cell culture sucrose/TOR",109,30833711,,,1.0000000,,,,,
LNIDTDSSSPQNIISPK,ph,S,404,true,"Col-0 callus - FC Col-0 vs. Col-0 Xray",111a,31410901,,93.0600000,,1.0785103,0.0391545,YES,,1.2702358
LNIDTDSSSPQNIISPK,ph,S,404,true,"Col-0 X-ray callus - FC Col-0 vs. Col-0 Xray",111b,31410901,,93.0600000,,1.0785103,0.0391545,YES,,1.2702358
LNIDTDSSSPQNIISPK,ph,S,404,true,"atm callus - FC atm vs. atm Xray",111c,31410901,,93.0600000,,0.7344571,0.2035666,NO,,1.2702358
LNIDTDSSSPQNIISPK,ph,S,404,true,"atm-3 X-ray callus - FC atm vs. atm Xray",111d,31410901,,93.0600000,,0.7344571,0.2035666,NO,,1.2702358
LNIDTDSSSPQNIISPK,ph,S,404,true,"Tissue atlas Arabidopsis - ProteomicsDB",114,32188942,"MaxQuant score",391.6400000,1.0000000,,,,0,
LNIDTDSSSPQNIISPK,ph,S,404,true,"Touch-induced phosphorylation: 40s touch vs untouc",136,30291188,"MASCOT score",100.0000000,,-0.1985313,0.5682412,NO,,3.8961126
IKEPDVQEDSSSFVR,ub,K,410,true,"upl3 mutant / wildtype",168,35926874,"MaxQuant score",56.5140000,1.0000000,-0.6529013,,,0.0004876260063611,-1.7180000
LVPDLSTK,ph,S,487,true,"Phosphoproteome ethylene-regulated time response",46,24043427,"MASCOT Score",34.8600000,,,,,,24.8378000
LVPDLSTK,ph,T,488,true,"Phosphoproteome ethylene-regulated time response",46,24043427,"MASCOT Score",34.8600000,,,,,,24.8378000
KQGLLATFVPK,ub,K,634,true,"upl3 mutant / wildtype",168,35926874,"MaxQuant score",84.8820000,1.0000000,-0.3219281,0.5337000,NO,0.00027824399876408,1.3430000
AASPPGTPDGLVTNFEIK,ph,T,740,true,"Tissue atlas Arabidopsis - ProteomicsDB",114,32188942,"MaxQuant score",105.0200000,0.9998600,,,,2.9429199344122E-7,
