Peptide,PTM,ModifiedAA,ModifiedPosition,PeptideUniqueToGene,ExperimentDesc,ExpID,PubmedID,ScoreType,IdentScore,LocProb,Log2FChange,PQ-val,QuantSig,PEP,MassErrorPPM
ADTVEKVPTVVESSSSSTVEASNSAEK,nta,A,2,true,"Characterization plant N-terminal acetylation",6,22223895,"MASCOT Score",140.9000000,,,,,,
ADTVEKVPTVVESSSSSTVEASN,nta,A,2,true,"HUNTER N-terminome: legumain, GluC and trypsin",119,31951383,"MaxQuant score",40.7240000,,,,,,
VPTVVESSSSSTVEASNSAEK,ph,S,16,true,"Tissue atlas Arabidopsis - ProteomicsDB",114,32188942,"MaxQuant score",257.0600000,0.9060470,,,,0,
VPTVVESSSSSTVEASNSAEK,ph,S,18,true,"Tissue atlas Arabidopsis - ProteomicsDB",114,32188942,"MaxQuant score",223.8200000,0.7504340,,,,0,
VPTVVESSSSSTVEASNSAEKTEPTTEK,ph,S,23,true,"SnRK2 protein kinase substrates",85,23776212,XCorr,5.5121365,0.9100000,,,,4.2897300295275E-11,
VPTVVESSSSSTVEASNSAEK,ph,S,23,true,"atm and atr DNA damage response",88,25561503,"MASCOT Score",34.0000000,0.9990000,,,,,0.6100000
VPTVVESSSSSTVEASNSAEK,ph,S,23,true,"Tissue atlas Arabidopsis - ProteomicsDB",114,32188942,"MaxQuant score",213.2100000,0.8144310,,,,0,
VPTVVESSSSSTVEASNSAEKTEPTTEK,ph,S,25,true,"Tissue atlas Arabidopsis - ProteomicsDB",114,32188942,"MaxQuant score",273.9400000,0.9883760,,,,0,
VPTVVESSSSSTVEASNSAEK,ph,S,25,true,"atm and atr DNA damage response",88,25561503,"MASCOT Score",69.0000000,0.9940000,,,,,-0.2800000
VPTVVESSSSSTVEASNSAEK,ph,S,25,true,"TOR Kinase and ABA Receptor",100,29290610,XCorr,8.4943790,0.9946000,,,,2.9189999484376E-13,
EEEKPDSILEEPEDSNIK,ph,S,67,true,"Large-scale phosphorylation discovery",44,23111157,XCorr,3.2750000,,,,,,
EEEKPDSILEEPEDSNIK,ph,S,67,true,"TOR Kinase and ABA Receptor",100,29290610,XCorr,3.3549178,1.0000000,,,,0.012430000118911,
EEEKPDSILEEPEDSNIK,ph,S,67,true,"Tissue atlas Arabidopsis - ProteomicsDB",114,32188942,"MaxQuant score",252.5100000,1.0000000,,,,0,
TTCFVLGMLSR,so,C,147,true,"S-sulfenylation site detection using YAP1C",110,32714340,,,,,,,,
VDPTLREPQALCICPTR,so,C,167,true,"S-sulfenylation site detection using YAP1C",110,32714340,,,,,,,,
FTGITAELAVPDSTRGAPAATR,ph,S,200,true,"TOR Kinase and ABA Receptor",100,29290610,XCorr,3.3469687,0.8984000,,,,5.8999999055231E-6,
FTGITAELAVPDSTRGAPAATR,ph,S,200,true,"Tissue atlas Arabidopsis - ProteomicsDB",114,32188942,"MaxQuant score",165.4800000,0.7941000,,,,1.6815903870545E-39,
FTGITAELAVPDSTR,ph,S,200,true,"Large-scale phosphorylation discovery",44,23111157,XCorr,2.8520000,,,,,,
GAPVSAHVVIGTPGTLKK,ph,T,221,true,"Tissue atlas Arabidopsis - ProteomicsDB",114,32188942,"MaxQuant score",90.4750000,0.8361980,,,,1.2489200344135E-5,
GAPVSAHVVIGTPGTLK,ph,T,221,true,"Large-scale phosphorylation discovery",44,23111157,XCorr,4.4890000,,,,,,
SATFNETVKDFVARTVKDPNQLF,nt,S,280,true,"Arabidopsis translation initiation landscape - NT",167b,35069635,,,,,,,,
TVKDPNQLFVKR,ac,K,304,true,"Quantitative Acetylproteomics",101,29440448,,,,,,,,
ECLTQVLIATDVIAR,so,C,389,true,"S-sulfenylation site detection using YAP1C",110,32714340,,,,,,,,
