Peptide,PTM,ModifiedAA,ModifiedPosition,PeptideUniqueToGene,ExperimentDesc,ExpID,PubmedID,ScoreType,IdentScore,LocProb,Log2FChange,PQ-val,QuantSig,PEP,MassErrorPPM
AKEDEIEKR,ub,K,42,false,"Arabidopsis ubiquitination COFRADIC",40,26744219,"MaxQuant Score",94.6920000,1.0000000,,,,0.0010000000474975,0.1990000
AKEDEIEKR,ac,K,48,false,"Quantitative Acetylproteomics",101,29440448,,,,,,,,
AKEDEIEKR,ub,K,48,false,"Arabidopsis ubiquitination COFRADIC",40,26744219,"MaxQuant Score",63.0760000,1.0000000,,,,0.0080000003799796,-0.7020000
ELKPLGSTVQK,ph,S,108,false,"atm and atr DNA damage response",88,25561503,"MASCOT Score",30.0000000,0.9480000,,,,,-3.0900000
ELKPLGSTVQK,ph,S,108,false,"Tissue atlas Arabidopsis - ProteomicsDB",114,32188942,"MaxQuant score",134.9200000,0.8479550,,,,4.5180699999037E-6,
EYKEALDTFNEKNR,ub,K,118,false,"Arabidopsis ubiquitination COFRADIC",40,26744219,"MaxQuant Score",112.4200000,1.0000000,,,,1.3920000075244E-18,0.2950000
EYKEALDTFNEK,ub,K,118,false,"upl3 mutant / wildtype",168,35926874,"MaxQuant score",132.5000000,1.0000000,0.0989585,,,1.2594299825253E-8,0.4061900
EALDTFNEKNR,ac,K,127,false,"Quantitative Acetylproteomics",101,29440448,,,,,,,,
EYKEALDTFNEKNR,ub,K,127,false,"Arabidopsis ubiquitination COFRADIC",40,26744219,"MaxQuant Score",148.5200000,1.0000000,,,,5.2839999212118E-31,0.3580000
LKKLDELSR,ub,K,154,true,"Arabidopsis ubiquitination COFRADIC",40,26744219,"MaxQuant Score",72.2430000,0.9970000,,,,0.0010000000474975,0.6120000
LKKLDELSR,ub,K,154,true,"Ubiquitination Membrane Proteins",120,33585938,,,,,,,,
SIDTESESISQDKTIPIKN,ph,S,167,true,"Tissue atlas Arabidopsis - ProteomicsDB",114,32188942,"MaxQuant score",202.9200000,0.7828160,,,,5.6051938572993E-45,
SIDTESESISQDK,ph,S,169,true,"TOR Kinase and ABA Receptor",100,29290610,XCorr,4.0202088,0.9282000,,,,0.0012460000580177,
SIDTESESISQDK,ph,S,169,true,"Phospho cell culture sucrose/TOR",109,30833711,,,0.9569080,,,,,
SIDTESESISQDK,ph,S,169,true,"Tissue atlas Arabidopsis - ProteomicsDB",114,32188942,"MaxQuant score",327.2900000,0.9999930,,,,0,
