Peptide,PTM,ModifiedAA,ModifiedPosition,PeptideUniqueToGene,ExperimentDesc,ExpID,PubmedID,ScoreType,IdentScore,LocProb,Log2FChange,PQ-val,QuantSig,PEP,MassErrorPPM
RFVVEKNNLKVTSP,nt,R,20,true,"Arabidopsis translation initiation landscape - NT",167b,35069635,,,,,,,,
GDCYFTLK,ox,C,98,false,"OxiTRAQ Arabidopsis - 5 mM H2O2 versus control",47,24376095,,,,-0.2139765,0.2696162,NO,,
AEPLITMDTPEEDKSDADYLQNITIPSALITK,ng,N,143,true,"N-linked Glycan Micro-heterogeneity Arabidopsis",134,29237727,,,,,,,,
AEPLITMDTPEEDKSDADYLQNITIPSALITK,ng,N,143,true,"UDP-GlcNAc transporter glycopeptide analysis",135,30224661,,,,,,,1.8484751507231E-9,0.5000000
SDADYLQNITIPSALITK,ng,N,143,true,"Conserved N-glycosylation",74,22633491,"MaxQuant Score",174.0200000,1.0000000,,,,9.8090892502737E-45,1.2870000
CDTQIEFLK,ox,C,202,true,"OxiTRAQ Arabidopsis - 5 mM H2O2 versus control",47,24376095,,,,-0.1739767,0.1174223,NO,,
CDTQIEFLK,sno,C,202,true,"hot5-4 / wildtype, FAT-switch S-nitrosoproteome",169,37277371,,,,0.2584556,0.0979294,NO,,
SQCINHGR,sno,C,250,false,"hot5-4 / wildtype, FAT-switch S-nitrosoproteome",169,37277371,,,,,,,,
YCAPDPEQDFTK,sno,C,257,true,"hot5-4 / wildtype, FAT-switch S-nitrosoproteome",169,37277371,,,,0.8392261,0.0034574,YES,,
QACVYR,sno,C,283,true,"hot5-4 / wildtype, FAT-switch S-nitrosoproteome",169,37277371,,,,,,,,
ECADGIIK,ox,C,319,true,"OxiTRAQ Arabidopsis - 5 mM H2O2 versus control",47,24376095,,,,-0.1797473,0.1632130,NO,,
ECADGIIK,sno,C,319,true,"hot5-4 / wildtype, FAT-switch S-nitrosoproteome",169,37277371,,,,0.5480501,0.0001319,NO,,
CIGDPEADVENPVLK,ox,C,337,true,"SPEAR - 50 mM H2O2 / mock",138b,34619326,,,,0.5078307,0.0186162,YES,,
AANITACRDTFR,ng,N,429,true,"Conserved N-glycosylation",74,22633491,"MaxQuant Score",148.7500000,1.0000000,,,,0.003000000026077,-0.4440000
LCECPTVQGVK,ox,C,442,true,"OxiTRAQ Arabidopsis - 5 mM H2O2 versus control",47,24376095,,,,-0.1995376,0.1755442,NO,,
LCECPTVQGVK,ox,C,442,true,"Bicarbonate Induced Redox Changes - 30 min",117b,28184230,,,,0.2986583,,YES,,
LCECPTVQGVK,ox,C,444,true,"OxiTRAQ Arabidopsis - 5 mM H2O2 versus control",47,24376095,,,,-0.1995376,0.1755442,NO,,
LCECPTVQGVK,ox,C,444,true,"Bicarbonate Induced Redox Changes - 30 min",117b,28184230,,,,0.2986583,,YES,,
LCECPTVQGVK,sno,C,444,true,"hot5-4 / wildtype, FAT-switch S-nitrosoproteome",169,37277371,,,,,,,,
FVGDGYTHCK,ox,C,460,true,"OxiTRAQ Arabidopsis - 5 mM H2O2 versus control",47,24376095,,,,-0.1938888,0.1288172,NO,,
FVGDGYTHCK,sno,C,460,true,"hot5-4 / wildtype, FAT-switch S-nitrosoproteome",169,37277371,,,,,,,,
GGFTYSACVDDHSK,sno,C,488,true,"hot5-4 / wildtype, FAT-switch S-nitrosoproteome",169,37277371,,,,,,,,
CPLGFK,ox,C,498,true,"OxiTRAQ Arabidopsis - 5 mM H2O2 versus control",47,24376095,,,,-0.2586683,0.1335178,NO,,
NCEDVDECKEK,ox,C,510,true,"OxiTRAQ Arabidopsis - 5 mM H2O2 versus control",47,24376095,,,,-0.2107459,0.1709859,NO,,
NCEDVDECK,ox,C,510,true,"OxiTRAQ Arabidopsis - 5 mM H2O2 versus control",47,24376095,,,,-0.2672573,0.1390169,NO,,
NCEDVDECKEK,ox,C,516,true,"OxiTRAQ Arabidopsis - 5 mM H2O2 versus control",47,24376095,,,,-0.2107459,0.1709859,NO,,
NCEDVDECK,ox,C,516,true,"OxiTRAQ Arabidopsis - 5 mM H2O2 versus control",47,24376095,,,,-0.2672573,0.1390169,NO,,
TVCQCPECK,ox,C,522,true,"OxiTRAQ Arabidopsis - 5 mM H2O2 versus control",47,24376095,,,,-0.3297619,0.2475144,NO,,
TVCQCPECK,ox,C,524,true,"OxiTRAQ Arabidopsis - 5 mM H2O2 versus control",47,24376095,,,,-0.3297619,0.2475144,NO,,
TVCQCPECK,ox,C,527,true,"OxiTRAQ Arabidopsis - 5 mM H2O2 versus control",47,24376095,,,,-0.3297619,0.2475144,NO,,
EHDTCIGSGK,ox,C,553,true,"OxiTRAQ Arabidopsis - 5 mM H2O2 versus control",47,24376095,,,,-0.2157098,0.1595731,NO,,
EHDTCIGSGK,sno,C,553,true,"hot5-4 / wildtype, FAT-switch S-nitrosoproteome",169,37277371,,,,,,,,
