Peptide,PTM,ModifiedAA,ModifiedPosition,PeptideUniqueToGene,ExperimentDesc,ExpID,PubmedID,ScoreType,IdentScore,LocProb,Log2FChange,PQ-val,QuantSig,PEP,MassErrorPPM
YLCSGCDFSGLDPTLIPR,sno,C,124,true,"S-Nitroso-Proteome guard cells - 30 min flg22",116b,32121556,,,,-1.7369656,0.0390000,YES,,
YLCSGCDFSGLDPTLIPR,sno,C,127,true,"S-Nitroso-Proteome guard cells - 30 min flg22",116b,32121556,,,,-1.7369656,0.0390000,YES,,
IIGCQSPK,ox,C,153,true,"OxiTRAQ Arabidopsis - 5 mM H2O2 versus control",47,24376095,,,,-0.1471074,0.1293934,NO,,
IIGCQSPK,sno,C,153,true,"hot5-4 / wildtype, FAT-switch S-nitrosoproteome",169,37277371,,,,-0.0015810,0.9061428,NO,,
CQFLYGPNVQCR,acy,C,158,true,"Arabidopsis S-acylation atlas - Meristem",163a,35681017,,,,,,,,
CQFLYGPNVQCR,acy,C,168,true,"Arabidopsis S-acylation atlas - Meristem",163a,35681017,,,,,,,,
GCDPNTR,sno,C,171,true,"hot5-4 / wildtype, FAT-switch S-nitrosoproteome",169,37277371,,,,,,,,
GPVSLPSQMNLKR,ac,K,245,true,"Quantitative Acetylproteomics",101,29440448,,,,,,,,
FSHCLVSR,sno,C,250,true,"hot5-4 / wildtype, FAT-switch S-nitrosoproteome",169,37277371,,,,,,,,
RFDDTNVTTDLDLDTGSGHNSGSK,ng,N,260,true,"Conserved N-glycosylation",74,22633491,"MaxQuant Score",310.5800000,1.0000000,,,,0,1.6820000
RFDDTNVTTDLDLDTGSGHNSGSK,ng,N,260,true,"N-glycan occupancy Arabidopsis glycoproteins",87,23994444,"Ladder score",63.8000000,,,,,,
RFDDTNVTTDLDLDTGSGHNSGSK,ng,N,260,true,"N-Glycopeptide Profiling in Arabidopsis Infloresce",132,27067053,"MOWSE score",20.6000000,,,,,0.0092000002041459,
RFDDTNVTTDLDLDTGSGHNSGSK,ng,N,260,true,"N-linked Glycan Micro-heterogeneity Arabidopsis",134,29237727,,,,,,,,
RFDDTNVTTDLDLDTGSGHNSGSK,ng,N,260,true,"UDP-GlcNAc transporter glycopeptide analysis",135,30224661,,,,,,,7.473665134576E-26,0.1000000
FDDTNVTTDLDLDTGSGHNSGSK,ng,N,260,true,"UDP-GlcNAc transporter glycopeptide analysis",135,30224661,,,,,,,1.4042011889392E-22,0.7000000
TPGLTYTPFRKNPNVSNK,ng,N,292,true,"Conserved N-glycosylation",74,22633491,"MaxQuant Score",95.8720000,0.8570000,,,,4.3370000639698E-6,0.0640000
PVFELVAEEFASQMSNYTR,ng,N,362,true,"Conserved N-glycosylation",74,22633491,"MaxQuant Score",165.2000000,1.0000000,,,,1.1529883764465E-41,-0.7190000
EKDLEKETGLGPCFNISGK,ng,N,380,true,"UDP-GlcNAc transporter glycopeptide analysis",135,30224661,,,,,,,8.345633517213E-15,0.6000000
ETGLGPCFNISGK,ng,N,380,true,"Conserved N-glycosylation",74,22633491,"MaxQuant Score",255.7800000,1.0000000,,,,0,0.0890000
ETGLGPCFNISGK,ng,N,380,true,"N-glycan occupancy Arabidopsis glycoproteins",87,23994444,"Ladder score",64.0000000,,,,,,
ETGLGPCFNISGK,ng,N,380,true,"N-linked Glycan Micro-heterogeneity Arabidopsis",134,29237727,,,,,,,,
ETGLGPCFNISGK,ng,N,380,true,"UDP-GlcNAc transporter glycopeptide analysis",135,30224661,,,,,,,2.0855949629761E-16,1.1000000
