Peptide,PTM,ModifiedAA,ModifiedPosition,PeptideUniqueToGene,ExperimentDesc,ExpID,PubmedID,ScoreType,IdentScore,LocProb,Log2FChange,PQ-val,QuantSig,PEP,MassErrorPPM
MNDLLSGSFK,nta,M,1,true,"Characterization plant N-terminal acetylation",6,22223895,"MASCOT Score",57.5100000,,,,,,
MNDLLSGSFK,ph,S,8,true,"Arabidopsis root NAA phosphoproteome",18a,27643528,"MaxQuant Score",46.7970000,0.7920000,,,,0.0010000000474975,-0.3050000
MNDLLSGSFK,ph,S,8,true,"atm and atr DNA damage response",88,25561503,"MASCOT Score",49.0000000,0.9980000,,,,,0.0200000
MNDLLSGSFK,ph,S,8,true,"TOR Kinase and ABA Receptor",100,29290610,XCorr,3.4905407,1.0000000,,,,0.00019140000222251,
MNDLLSGSFK,ph,S,8,true,"Phospho cell culture sucrose/TOR",109,30833711,,,0.9489650,,,,,
MNDLLSGSFK,ph,S,8,true,"Tissue atlas Arabidopsis - ProteomicsDB",114,32188942,"MaxQuant score",156.0200000,0.9994760,,,,1.5855799517794E-7,
NDLLSGSFK,ph,S,8,true,"Plasmamembrane phosphorylation",20,15308754,,,,,,,,
NDLLSGSFK,ph,S,8,true,"Phosphorylation Early Elicitor Signaling",23,17317660,,,,,,,,
TSVADGSSPPHSHNIEMSK,ph,S,17,true,"Phosphoproteome iron-deficient Arabidopsis roots",41,22438062,"MASCOT Score",68.7100000,,,,,,
TSVADGSSPPHSHNIEMSK,ph,S,17,true,"Phosphoproteome ethylene-regulated time response",46,24043427,"MASCOT Score",35.3300000,,,,,,-1.2647000
TSVADGSSPPHSHNIEMSK,ph,S,17,true,"Lateral root-induction - NAA vs control",106,23328941,"MASCOT Score",24.0000000,,,,,,
TSVADGSSPPHSHNIEMSK,ph,S,17,true,"Tissue atlas Arabidopsis - ProteomicsDB",114,32188942,"MaxQuant score",371.3600000,0.9387780,,,,0,
TSVADGSSPPHSHNIEMSK,ph,S,18,true,"Phosphorylation Early Elicitor Signaling",23,17317660,,,,,,,,
TSVADGSSPPHSHNIEMSK,ph,S,18,true,"Phytohormone-responsive phosphoproteins",34,20374526,"MASCOT Score",64.0000000,,,,,,-0.5511270
TSVADGSSPPHSHNIEMSK,ph,S,18,true,"Phosphoproteome iron-deficient Arabidopsis roots",41,22438062,"MASCOT Score",59.7900000,,,,,,
TSVADGSSPPHSHNIEMSK,ph,S,18,true,"Phosphoproteome ethylene-regulated time response",46,24043427,"MASCOT Score",49.4700000,,,,,,-3.6190000
TSVADGSSPPHSHNIEMSK,ph,S,18,true,"Tyrosine phosphorylation in Arabidopsis",59,18463617,"MASCOT Score",43.0000000,,,,,,-0.9223905
TSVADGSSPPHSHNIEMSK,ph,S,18,true,"srk2dei ABA signaling phopshoproteomics",83,23572148,"MASCOT Score",59.0000000,,,,,,-0.0010000
TSVADGSSPPHSHNIEMSK,ph,S,18,true,"atm and atr DNA damage response",88,25561503,"MASCOT Score",71.0000000,0.9940000,,,,,-0.0700000
TSVADGSSPPHSHNIEMSK,ph,S,18,true,"Brassinosteroid-Regulated Phosphorylation Dynamics",94,26187819,"MaxQuant Score",95.6620000,0.8340000,,,,0.0010000000474975,1.7280000
TSVADGSSPPHSHNIEMSK,ph,S,18,true,"TOR Kinase and ABA Receptor",100,29290610,XCorr,2.9419746,0.8174000,,,,0.0022479998879135,
TSVADGSSPPHSHNIEMSK,ph,S,18,true,"Lateral root-induction - NAA vs control",106,23328941,"MASCOT Score",26.0000000,,,,,,
TSVADGSSPPHSHNIEMSK,ph,S,18,true,"Phospho cell culture sucrose/TOR",109,30833711,,,0.9655620,,,,,
TSVADGSSPPHSHNIEMSK,ph,S,18,true,"Col-0 X-ray callus - FC Col-0 vs. Col-0 Xray",111b,31410901,,33.7300000,,0.0000000,0.0000000,NO,,1.4048031
TSVADGSSPPHSHNIEMSK,ph,S,18,true,"atm callus - FC atm vs. atm Xray",111c,31410901,,33.7300000,,-0.4028299,0.0000000,NO,,1.4048031
TSVADGSSPPHSHNIEMSK,ph,S,18,true,"atm-3 X-ray callus - FC atm vs. atm Xray",111d,31410901,,33.7300000,,-0.4028299,0.0000000,NO,,1.4048031
TSVADGSSPPHSHNIEMSK,ph,S,18,true,"Tissue atlas Arabidopsis - ProteomicsDB",114,32188942,"MaxQuant score",431.9700000,0.9994140,,,,0,
TSVADGSSPPHSHNIEMSK,ph,S,22,true,"Phosphorylation Early Elicitor Signaling",23,17317660,,,,,,,,
TSVADGSSPPHSHNIEMSK,ph,S,22,true,"srk2dei ABA signaling phopshoproteomics",83,23572148,"MASCOT Score",36.0000000,,,,,,0.0002000
TSVADGSSPPHSHNIEMSK,ph,S,22,true,"Tissue atlas Arabidopsis - ProteomicsDB",114,32188942,"MaxQuant score",62.6780000,0.8739770,,,,0.0003128059906885,
TSVADGSSPPHSHNIEMSK,ph,S,28,true,"Tyrosine phosphorylation in Arabidopsis",59,18463617,"MASCOT Score",33.0000000,,,,,,-0.7225920
TSVADGSSPPHSHNIEMSK,ph,S,28,true,"srk2dei ABA signaling phopshoproteomics",83,23572148,"MASCOT Score",58.0000000,,,,,,0.0003000
KMDADVTAALKTAR,ub,K,99,true,"Ubiquitination Membrane Proteins",120,33585938,,,,,,,,
MDADVTAALKTAR,ub,K,99,true,"Ubiquitination Membrane Proteins",120,33585938,,,,,,,,
LISTGESETFLQK,ph,S,189,true,"Phosphorylation Early Elicitor Signaling",23,17317660,,,,,,,,
LISTGESETFLQK,ph,S,189,true,"Tissue atlas Arabidopsis - ProteomicsDB",114,32188942,"MaxQuant score",242.4800000,0.9992250,,,,0,
FLQKAIQEQGR,ac,K,199,false,"Quantitative Acetylproteomics",101,29440448,,,,,,,,
HDAVKDIEK,ac,K,224,false,"Quantitative Acetylproteomics",101,29440448,,,,,,,,
RANSLVR,ph,S,263,true,"TOR Kinase and ABA Receptor",100,29290610,XCorr,2.7647758,1.0000000,,,,0.0024510000366718,
RANSLVR,ph,S,263,true,"Phospho cell culture sucrose/TOR",109,30833711,,,1.0000000,,,,,
ANSLVR,ph,S,263,true,"Sucrose-induced phosphorylation",24,17586839,,,,,,,,
