Peptide,PTM,ModifiedAA,ModifiedPosition,PeptideUniqueToGene,ExperimentDesc,ExpID,PubmedID,ScoreType,IdentScore,LocProb,Log2FChange,PQ-val,QuantSig,PEP,MassErrorPPM
KLDVTNSGAAYSPR,ph,S,43,true,"atm and atr DNA damage response",88,25561503,"MASCOT Score",43.0000000,1.0000000,,,,,-0.6600000
KLDVTNSGAAYSPR,ph,S,43,true,"Tissue atlas Arabidopsis - ProteomicsDB",114,32188942,"MaxQuant score",116.9800000,0.9910990,,,,3.3814598282333E-5,
KLDVTNSGAAYSPR,ph,Y,47,true,"atm and atr DNA damage response",88,25561503,"MASCOT Score",62.0000000,0.9990000,,,,,-1.7000000
KLDVTNSGAAYSPR,ph,S,48,true,"atm and atr DNA damage response",88,25561503,"MASCOT Score",75.0000000,0.9650000,,,,,0.0900000
KLDVTNSGAAYSPR,ph,S,48,true,"TOR Kinase and ABA Receptor",100,29290610,XCorr,3.6675274,0.9947000,,,,8.9610000486573E-7,
KLDVTNSGAAYSPR,ph,S,48,true,"Touch-induced phosphorylation: 40s touch vs untouc",136,30291188,"MASCOT score",80.6700000,,-0.0647064,0.7144638,NO,,6.6599729
LDVTNSGAAYSPR,ph,S,48,true,"Phosphorylation Early Elicitor Signaling",23,17317660,,,,,,,,
LDVTNSGAAYSPR,ph,S,48,true,"Large-scale phosphorylation discovery",44,23111157,XCorr,4.3810000,,,,,,
LDVTNSGAAYSPR,ph,S,48,true,"atm and atr DNA damage response",88,25561503,"MASCOT Score",76.0000000,0.9960000,,,,,0.1900000
LDVTNSGAAYSPR,ph,S,48,true,"Tissue atlas Arabidopsis - ProteomicsDB",114,32188942,"MaxQuant score",210.0700000,1.0000000,,,,1.2723790056069E-42,
LKEIEEQQSR,ph,S,65,true,"atm and atr DNA damage response",88,25561503,"MASCOT Score",43.0000000,1.0000000,,,,,-0.9800000
LKEIEEQQSR,ph,S,65,true,"Tissue atlas Arabidopsis - ProteomicsDB",114,32188942,"MaxQuant score",166.0300000,1.0000000,,,,5.1134298928446E-7,
LKSLVQGK,ph,S,138,true,"atm and atr DNA damage response",88,25561503,"MASCOT Score",31.0000000,1.0000000,,,,,-2.9200000
LKSLVQGK,ph,S,138,true,"Tissue atlas Arabidopsis - ProteomicsDB",114,32188942,"MaxQuant score",96.2290000,1.0000000,,,,0.010671400465071,
ALAYAFSHQNTWK,ph,T,236,true,"Tissue atlas Arabidopsis - ProteomicsDB",114,32188942,"MaxQuant score",121.7900000,0.9962750,,,,0.00017908499285113,
PNENHSLTPDNAEK,ph,T,276,true,"atm and atr DNA damage response",88,25561503,"MASCOT Score",26.0000000,1.0000000,,,,,-0.5400000
AMSEMIPR,ph,S,295,true,"atm and atr DNA damage response",88,25561503,"MASCOT Score",38.0000000,1.0000000,,,,,0.6000000
AMSEMIPR,ph,S,295,true,"TOR Kinase and ABA Receptor",100,29290610,XCorr,2.6610787,1.0000000,,,,0.0017859999788925,
AMSEMIPR,ph,S,295,true,"Tissue atlas Arabidopsis - ProteomicsDB",114,32188942,"MaxQuant score",104.4200000,1.0000000,,,,0.0010259000118822,
FSNLSPLSSEK,ph,S,388,true,"atm and atr DNA damage response",88,25561503,"MASCOT Score",74.0000000,1.0000000,,,,,-0.0400000
FSNLSPLSSEK,ph,S,388,true,"TOR Kinase and ABA Receptor",100,29290610,XCorr,3.7918966,1.0000000,,,,0.0013310000067577,
FSNLSPLSSEK,ph,S,388,true,"Tissue atlas Arabidopsis - ProteomicsDB",114,32188942,"MaxQuant score",167.7700000,0.9999760,,,,1.8515999497537E-11,
RLSFSGSPK,ph,S,401,true,"atm and atr DNA damage response",88,25561503,"MASCOT Score",36.0000000,0.9980000,,,,,-1.1700000
RLSFSGSPK,ph,S,401,true,"Tissue atlas Arabidopsis - ProteomicsDB",114,32188942,"MaxQuant score",109.1600000,0.9979640,,,,0.00041574699571356,
RLSFSGSPK,ph,S,405,true,"atm and atr DNA damage response",88,25561503,"MASCOT Score",32.0000000,1.0000000,,,,,-2.2300000
LSFSGSPK,ph,S,405,true,"atm and atr DNA damage response",88,25561503,"MASCOT Score",31.0000000,0.9300000,,,,,-2.1200000
LSFSGSPK,ph,S,405,true,"Tissue atlas Arabidopsis - ProteomicsDB",114,32188942,"MaxQuant score",112.1300000,0.9979620,,,,0.0035341801121831,
RFSGPPKLESNVTK,ph,S,413,true,"Tissue atlas Arabidopsis - ProteomicsDB",114,32188942,"MaxQuant score",114.9000000,1.0000000,,,,1.860009979282E-5,
