Peptide,PTM,ModifiedAA,ModifiedPosition,PeptideUniqueToGene,ExperimentDesc,ExpID,PubmedID,ScoreType,IdentScore,LocProb,Log2FChange,PQ-val,QuantSig,PEP,MassErrorPPM
WRDSPSSHHVPR,ph,S,36,true,"Tissue atlas Arabidopsis - ProteomicsDB",114,32188942,"MaxQuant score",126.0700000,0.9990730,,,,9.4808601716068E-6,
SFERPFGIR,ph,S,132,true,"Tissue atlas Arabidopsis - ProteomicsDB",114,32188942,"MaxQuant score",72.6520000,1.0000000,,,,0.013711100444198,
SVDERPLHASDTHSTVVNSLDPANSAHYLDNEISTPVR,ph,S,145,true,"Tissue atlas Arabidopsis - ProteomicsDB",114,32188942,"MaxQuant score",148.1600000,0.9546360,,,,0,
SVDERPLHASDTHSTVVNSLDPANSAHYLDNEISTPVR,ph,T,179,true,"Tissue atlas Arabidopsis - ProteomicsDB",114,32188942,"MaxQuant score",162.3500000,0.9353900,,,,0,
LSLPSDPHSECISLFERPSSENNYGNKVCSPAK,ph,S,226,true,"Tissue atlas Arabidopsis - ProteomicsDB",114,32188942,"MaxQuant score",89.3390000,0.9857270,,,,2.7885300696734E-18,
LKDPQDNNSLHGINDIDGDRK,ph,S,272,true,"Tissue atlas Arabidopsis - ProteomicsDB",114,32188942,"MaxQuant score",73.2130000,1.0000000,,,,7.6329297371558E-6,
ESSLGATGKLPLWNSSGSFASQSSGFSHSSSLK,fuc,S,308,true,"SPINDLY O-fucosylation",162,36739885,,,,,,,-1,
LPLWNSSGSFASQSSGFSHSSSLK,fuc,S,308,true,"SPINDLY O-fucosylation",162,36739885,,,,,,,0.91000002622604,
IVTVTQSSSGDATACATTTHLSEEMSSR,ph,S,346,true,"Tissue atlas Arabidopsis - ProteomicsDB",114,32188942,"MaxQuant score",168.0900000,0.9651090,,,,0,
AAIAASDVSNMCRSPSPVSSIHLER,ph,S,461,true,"SnRK2 protein kinase substrates",85,23776212,XCorr,4.0967941,0.9720000,,,,3.96250006599E-16,
AAIAASDVSNMCRSPSPVSSIHLER,ph,S,461,true,"Phospho cell culture sucrose/TOR",109,30833711,,,0.9105020,,,,,
SPSPVSSIHLER,ph,S,461,true,"LAXIC - mannitol vs control",84b,23660473,XCorr,2.6600000,1.0000000,,,,0.00049594900337979,
SPSPVSSIHLER,ph,S,461,true,"atm and atr DNA damage response",88,25561503,"MASCOT Score",42.0000000,1.0000000,,,,,-0.3700000
SPSPVSSIHLER,ph,S,461,true,"Tissue atlas Arabidopsis - ProteomicsDB",114,32188942,"MaxQuant score",171.8800000,1.0000000,,,,0,
AAIAASDVSNMCRSPSPVSSIHLER,ph,S,463,true,"Large-scale phosphorylation discovery",44,23111157,XCorr,5.2520000,,,,,,
AAIAASDVSNMCRSPSPVSSIHLER,ph,S,463,true,"SnRK2 protein kinase substrates",85,23776212,XCorr,4.0967941,0.9690000,,,,3.96250006599E-16,
SPSPVSSIHLER,ph,S,463,true,"LAXIC - mannitol vs control",84b,23660473,XCorr,2.6600000,1.0000000,,,,0.00049594900337979,
SPSPVSSIHLER,ph,S,463,true,"atm and atr DNA damage response",88,25561503,"MASCOT Score",42.0000000,1.0000000,,,,,-0.3700000
SPSPVSSIHLER,ph,S,463,true,"Tissue atlas Arabidopsis - ProteomicsDB",114,32188942,"MaxQuant score",171.8800000,0.9999960,,,,0,
AAIAASDVSNMCRSPSPVSSIHLER,ph,S,466,true,"Large-scale phosphorylation discovery",44,23111157,XCorr,5.8500000,,,,,,
ADLSRSEEENGQK,ph,S,1216,true,"Tissue atlas Arabidopsis - ProteomicsDB",114,32188942,"MaxQuant score",101.6800000,0.9243010,,,,0.00037918399902992,
SKSDLIVK,ph,S,1461,true,"srk2dei ABA signaling phopshoproteomics",83,23572148,"MASCOT Score",39.0000000,,,,,,0.0004000
SKSDLIVK,ph,S,1461,true,"SnRK2 protein kinase substrates",85,23776212,XCorr,2.6400566,0.9970000,,,,0.097776003181934,
SKSDLIVK,ph,S,1461,true,"atm and atr DNA damage response",88,25561503,"MASCOT Score",32.0000000,0.9730000,,,,,-3.4200000
SKSDLIVK,ph,S,1461,true,"Phospho cell culture sucrose/TOR",109,30833711,,,0.9956260,,,,,
SKSDLIVK,ph,S,1461,true,"Tissue atlas Arabidopsis - ProteomicsDB",114,32188942,"MaxQuant score",136.5300000,0.9999750,,,,0.004715490154922,
SHSFSLSDTER,ph,S,1501,true,"Lateral root-induction - NAA vs control",106,23328941,"MASCOT Score",44.0000000,,,,,,
SHSFSLSDTER,ph,S,1503,true,"srk2dei ABA signaling phopshoproteomics",83,23572148,"MASCOT Score",46.0000000,,,,,,-0.0004000
SHSFSLSDTER,ph,S,1503,true,"SnRK2 protein kinase substrates",85,23776212,XCorr,2.2463923,0.9940000,,,,0.0016639799578115,
SHSFSLSDTER,ph,S,1503,true,"atm and atr DNA damage response",88,25561503,"MASCOT Score",62.0000000,1.0000000,,,,,0.2300000
SHSFSLSDTER,ph,S,1503,true,"TOR Kinase and ABA Receptor",100,29290610,XCorr,2.9603667,0.9942000,,,,0.00026010000146925,
SHSFSLSDTER,ph,S,1503,true,"Lateral root-induction - NAA vs control",106,23328941,"MASCOT Score",33.0000000,,,,,,
SHSFSLSDTER,ph,S,1503,true,"Phospho cell culture sucrose/TOR",109,30833711,,,0.9999640,,,,,
SHSFSLSDTER,ph,S,1503,true,"Col-0 callus - FC Col-0 vs. Col-0 Xray",111a,31410901,,40.6000000,,0.3624196,0.0000000,NO,,0.4580180
SHSFSLSDTER,ph,S,1503,true,"Col-0 X-ray callus - FC Col-0 vs. Col-0 Xray",111b,31410901,,40.6000000,,0.3624196,0.0000000,NO,,0.4580180
SHSFSLSDTER,ph,S,1503,true,"atm callus - FC atm vs. atm Xray",111c,31410901,,40.6000000,,0.3974999,0.0000000,NO,,0.4580180
SHSFSLSDTER,ph,S,1503,true,"atm-3 X-ray callus - FC atm vs. atm Xray",111d,31410901,,40.6000000,,0.3974999,0.0000000,NO,,0.4580180
SHSFSLSDTER,ph,S,1503,true,"Tissue atlas Arabidopsis - ProteomicsDB",114,32188942,"MaxQuant score",262.3500000,0.9999990,,,,0,
SHSFSLSDTER,ph,S,1503,true,"Touch-induced phosphorylation: 40s touch vs untouc",136,30291188,"MASCOT score",60.3700000,,0.0096935,0.9615271,NO,,4.2026009
