Peptide,PTM,ModifiedAA,ModifiedPosition,PeptideUniqueToGene,ExperimentDesc,ExpID,PubmedID,ScoreType,IdentScore,LocProb,Log2FChange,PQ-val,QuantSig,PEP,MassErrorPPM
EPGSSDKIKENR,ub,K,129,true,"Arabidopsis ubiquitination COFRADIC",40,26744219,"MaxQuant Score",61.1100000,0.9700000,,,,0.00060259999008849,0.3970000
GFECAYFSSPR,ph,S,147,true,"Tissue atlas Arabidopsis - ProteomicsDB",114,32188942,"MaxQuant score",191.5300000,0.9651730,,,,2.8613201024217E-18,
GNSTDINLER,ph,S,227,true,"Tissue atlas Arabidopsis - ProteomicsDB",114,32188942,"MaxQuant score",209.6700000,0.9998560,,,,8.2085300398442E-20,
SSALDLCDVGNHSDVTDESNGEK,ph,S,277,true,"Tissue atlas Arabidopsis - ProteomicsDB",114,32188942,"MaxQuant score",217.7800000,0.9855850,,,,0,
AQSPLQGSTVVPSLR,ph,S,290,true,"STN8 phosphoproteome",38,21768351,"MASCOT Score",65.8400000,,,,,,-0.9003960
AQSPLQGSTVVPSLR,ph,S,290,true,"atm and atr DNA damage response",88,25561503,"MASCOT Score",55.0000000,1.0000000,,,,,-0.3400000
AQSPLQGSTVVPSLR,ph,S,290,true,"TOR Kinase and ABA Receptor",100,29290610,XCorr,3.8995910,1.0000000,,,,3.3999999686785E-6,
AQSPLQGSTVVPSLR,ph,S,290,true,"Tissue atlas Arabidopsis - ProteomicsDB",114,32188942,"MaxQuant score",214.8100000,1.0000000,,,,0,
AQSPLQGSTVVPSLR,ph,S,290,true,"Touch-induced phosphorylation: 40s touch vs untouc",136,30291188,"MASCOT score",89.0900000,,-0.1563265,0.6803076,NO,,3.0974285
AQSPLQGSTVVPSLR,ph,S,300,true,"Tissue atlas Arabidopsis - ProteomicsDB",114,32188942,"MaxQuant score",184.6100000,0.9999430,,,,2.7094800900829E-25,
SIANEVDFR,ph,S,306,true,"atm and atr DNA damage response",88,25561503,"MASCOT Score",34.0000000,1.0000000,,,,,0.5700000
SIANEVDFR,ph,S,306,true,"Phospho cell culture sucrose/TOR",109,30833711,,,1.0000000,,,,,
SIANEVDFR,ph,S,306,true,"Tissue atlas Arabidopsis - ProteomicsDB",114,32188942,"MaxQuant score",151.0700000,1.0000000,,,,8.9350702182855E-5,
ESFETLSHGSPDNSVTSPDK,ph,T,319,true,"Tissue atlas Arabidopsis - ProteomicsDB",114,32188942,"MaxQuant score",118.3700000,0.7643750,,,,3.1273200175319E-12,
ESFETLSHGSPDNSVTSPDK,ph,S,321,true,"Tissue atlas Arabidopsis - ProteomicsDB",114,32188942,"MaxQuant score",197.8400000,0.9977500,,,,0,
ESFETLSHGSPDNSVTSPDK,ph,S,324,true,"Large-scale phosphorylation discovery",44,23111157,XCorr,3.3930000,,,,,,
ESFETLSHGSPDNSVTSPDK,ph,S,324,true,"Tissue atlas Arabidopsis - ProteomicsDB",114,32188942,"MaxQuant score",261.1700000,0.9999750,,,,0,
SVEQDAYSSR,ph,S,343,true,"atm and atr DNA damage response",88,25561503,"MASCOT Score",48.0000000,1.0000000,,,,,-0.0500000
SVEQDAYSSR,ph,S,343,true,"Tissue atlas Arabidopsis - ProteomicsDB",114,32188942,"MaxQuant score",74.9870000,0.9999990,,,,0.0041700298897922,
SVEQDAYSSR,ph,S,350,true,"Tissue atlas Arabidopsis - ProteomicsDB",114,32188942,"MaxQuant score",70.5400000,0.7723390,,,,0.0057020499370992,
HISESPTSEYSQPQSSK,ph,S,359,true,"TOR Kinase and ABA Receptor",100,29290610,XCorr,4.2448330,0.8798000,,,,6.1820001064916E-6,
HISESPTSEYSQPQSSK,ph,S,361,true,"Phospho cell culture sucrose/TOR",109,30833711,,,0.8434810,,,,,
HISESPTSEYSQPQSSK,ph,S,361,true,"Tissue atlas Arabidopsis - ProteomicsDB",114,32188942,"MaxQuant score",259.0200000,0.9882590,,,,0,
GINEHSSSTIRSPPVTQPNSR,ph,S,385,true,"Tissue atlas Arabidopsis - ProteomicsDB",114,32188942,"MaxQuant score",193.7800000,0.9966410,,,,0,
VSGSAISGGTSGFEGNQVSSSTYNTPVTPTR,fuc,S,621,true,"SPINDLY O-fucosylation",162,36739885,,,,,,,1.3999999761581,
VSGSAISGGTSGFEGNQVSSSTYNTPVTPTR,ph,T,638,true,"TOR Kinase and ABA Receptor",100,29290610,XCorr,5.0809641,0.8672000,,,,2.900000072259E-5,
SLYPDSVLSSR,og,S,642,true,"O-GlcNac Inflorescence Tissue",81,28154133,"MASCOT Score",28.5000000,,,,,,3.2000000
