Peptide,PTM,ModifiedAA,ModifiedPosition,PeptideUniqueToGene,ExperimentDesc,ExpID,PubmedID,ScoreType,IdentScore,LocProb,Log2FChange,PQ-val,QuantSig,PEP,MassErrorPPM
SSTLSNEESGLGDSNR,nt,S,2,true,"Tic56 chloroplast import - wild-type",89a,25588737,XCorr,2.8243704,,,,,,
SSTLSNEESGLGDSNR,nt,S,2,true,"Tic56 chloroplast import - ppi2",89b,25588737,XCorr,2.8858140,,,,,,
SSTLSNEESGLGDSNR,nt,S,2,true,"Stromal N-terminome",96,26371235,"MASCOT Score",40.6000000,,,,,,
SSTLSNEESGLGDSNR,nt,S,2,true,"Arg/N-end rule seed, prt6 vs. Wt",99,29168982,"MASCOT Score",90.0000000,,,,,0.0006580000044778,0.6844043
SSTLSNEESG,nt,S,2,true,"N-term acetylation drought responses",5,26184543,,,,,,,,
SSTLSNEESGLGDSNR,nta,S,2,true,"Characterization plant N-terminal acetylation",6,22223895,"MASCOT Score",95.3100000,,,,,,
SSTLSNEESGLGDSNR,nta,S,2,true,"Arg/N-end rule pathway Roots",80,25728785,"MASCOT Score",71.5200000,,,,,2.0330001007096E-6,
SSTLSNEESGLGDSNR,nta,S,2,true,"Tic56 chloroplast import - wild-type",89a,25588737,XCorr,2.8243704,,,,,,
SSTLSNEESGLGDSNR,nta,S,2,true,"Tic56 chloroplast import - ppi2",89b,25588737,XCorr,2.8858140,,,,,,
SSTLSNEESGLGDSNR,nta,S,2,true,"Stromal N-terminome",96,26371235,"MASCOT Score",40.6000000,,,,,,
SSTLSNEESGLGDSNR,nta,S,2,true,"Arg/N-end rule seed, prt6 vs. Wt",99,29168982,"MASCOT Score",90.0000000,,,,,0.0006580000044778,0.6844043
SSTLSNEESGLGDSNR,nta,S,2,true,"FtsH12 N-terminome: WT / FtsH12 knockdown miRNA",118,33216923,"MaxQuant score",58.2720000,,-0.0970297,0.9697964,NO,4.2799998482224E-5,
SSTLSNEESGLGDSNR,nta,S,2,true,"HUNTER N-terminome: legumain, GluC and trypsin",119,31951383,"MaxQuant score",235.7300000,,,,,,
SSTLSNEESGLGDSNR,nta,S,2,true,"Arabidopsis translation initiation landscape - NTA",167a,35069635,,,,,,,,
SSTLSNEESG,nta,S,2,true,"N-term acetylation drought responses",5,26184543,,,,,,,,
SSTLSNEESGLGDSNR,ph,S,6,true,"atm and atr DNA damage response",88,25561503,"MASCOT Score",54.0000000,0.9990000,,,,,0.2900000
SSTLSNEESGLGDSNR,ph,S,6,true,"Tissue atlas Arabidopsis - ProteomicsDB",114,32188942,"MaxQuant score",305.1900000,1.0000000,,,,0,
SSTLSNEESGLGDSNR,ph,S,10,true,"Tissue atlas Arabidopsis - ProteomicsDB",114,32188942,"MaxQuant score",207.7900000,0.9999430,,,,0,
FQSQRFDSSFSNFDSQPEK,ph,S,38,true,"TOR Kinase and ABA Receptor",100,29290610,XCorr,4.4702783,0.9881000,,,,1.8780000345942E-6,
FQSQRFDSSFSNFDSQPEK,ph,S,38,true,"Tissue atlas Arabidopsis - ProteomicsDB",114,32188942,"MaxQuant score",308.8100000,1.0000000,,,,0,
FDSSFSNFDSQPEK,ph,S,43,true,"Tissue atlas Arabidopsis - ProteomicsDB",114,32188942,"MaxQuant score",180.9500000,0.9911340,,,,1.156850002466E-22,
FDSSFSNFDSQPEK,ph,S,44,true,"Tissue atlas Arabidopsis - ProteomicsDB",114,32188942,"MaxQuant score",226.6200000,0.9445650,,,,0,
FDSSFSNFDSQPEK,ph,S,46,true,"atm and atr DNA damage response",88,25561503,"MASCOT Score",35.0000000,0.9430000,,,,,0.5700000
ESDLPCGDSSPRPETQSPPSINSFDDTNDSILPPPSAMEK,ph,S,63,true,"Lateral root-induction - NAA vs control",106,23328941,"MASCOT Score",35.0000000,,,,,,
NVTIENNKKLNR,ub,K,148,true,"Arabidopsis ubiquitination COFRADIC",40,26744219,"MaxQuant Score",108.3500000,0.8790000,,,,3.3070001598245E-11,-0.0190000
NVTIENNKKLNR,ub,K,149,true,"Arabidopsis ubiquitination COFRADIC",40,26744219,"MaxQuant Score",196.3800000,0.9910000,,,,0,-0.2040000
