Peptide,PTM,ModifiedAA,ModifiedPosition,PeptideUniqueToGene,ExperimentDesc,ExpID,PubmedID,ScoreType,IdentScore,LocProb,Log2FChange,PQ-val,QuantSig,PEP,MassErrorPPM
NVTQAEIIEDLHDR,ng,N,57,true,"Conserved N-glycosylation",74,22633491,"MaxQuant Score",298.9100000,1.0000000,,,,0,0.2520000
NVTQAEIIEDLHDR,ng,N,57,true,"N-linked Glycan Micro-heterogeneity Arabidopsis",134,29237727,,,,,,,,
NVTQAEIIEDLHDR,ng,N,57,true,"UDP-GlcNAc transporter glycopeptide analysis",135,30224661,,,,,,,5.2880928641576E-16,0.1000000
MNLCGK,ox,C,111,true,"OxiTRAQ Arabidopsis - 5 mM H2O2 versus control",47,24376095,,,,-0.1791592,0.3011470,NO,,
MNLCGK,sno,C,111,true,"hot5-4 / wildtype, FAT-switch S-nitrosoproteome",169,37277371,,,,,,,,
QDSCGVCHRTVSE,nt,Q,123,true,"Arg/N-end rule seed, prt6 vs. Wt",99,29168982,"MASCOT Score",40.6900000,,-0.7539643,0.0065213,NO,1.3290000424604E-6,-0.5679652
QDSCGVCHRTVSE,nt,Q,123,true,"Arabidopsis translation initiation landscape - NT",167b,35069635,,,,,,,,
QDSCGVCHR,nt,Q,123,true,"Arg/N-end rule seed, prt6 vs. Wt",99,29168982,"MASCOT Score",43.1900000,,-1.4406056,0.0611351,NO,0.012400000356138,-2.1283748
QDSCGVCHR,sno,C,126,true,"hot5-4 / wildtype, FAT-switch S-nitrosoproteome",169,37277371,,,,,,,,
NDVCTLLR,ox,C,192,true,"OxiTRAQ Arabidopsis - 5 mM H2O2 versus control",47,24376095,,,,-0.1306573,0.1732959,NO,,
NDVCTLLR,sno,C,192,true,"hot5-4 / wildtype, FAT-switch S-nitrosoproteome",169,37277371,,,,-0.2156833,0.1675907,NO,,
ACPPEK,sno,C,198,true,"hot5-4 / wildtype, FAT-switch S-nitrosoproteome",169,37277371,,,,,,,,
