Peptide,PTM,ModifiedAA,ModifiedPosition,PeptideUniqueToGene,ExperimentDesc,ExpID,PubmedID,ScoreType,IdentScore,LocProb,Log2FChange,PQ-val,QuantSig,PEP,MassErrorPPM
MDASLSPFDHQK,ph,S,6,true,"Phosphorylation Early Elicitor Signaling",23,17317660,,,,,,,,
MDASLSPFDHQK,ph,S,6,true,"atm and atr DNA damage response",88,25561503,"MASCOT Score",58.0000000,0.9970000,,,,,0.0700000
MDASLSPFDHQK,ph,S,6,true,"Phospho cell culture sucrose/TOR",109,30833711,,,0.9999680,,,,,
MDASLSPFDHQK,ph,S,6,true,"Tissue atlas Arabidopsis - ProteomicsDB",114,32188942,"MaxQuant score",252.0800000,1.0000000,,,,0,
MDASLSPFDHQKTQNTEPK,ub,K,12,true,"upl3 mutant / wildtype",168,35926874,"MaxQuant score",60.0620000,1.0000000,,,,0.00021664200176019,-1.2634000
SFITSLITLR,ph,T,28,true,"TOR Kinase and ABA Receptor",100,29290610,XCorr,2.6142702,1.0000000,,,,0.00011300000187475,
SNNIKEDTYFVSELKPTEQK,ph,S,31,true,"Phosphorylation Early Elicitor Signaling",23,17317660,,,,,,,,
SNNIKEDTYFVSELKPTEQK,ph,S,31,true,"Phospho cell culture sucrose/TOR",109,30833711,,,0.9997120,,,,,
SNNIKEDTYFVSELKPTEQK,ph,S,31,true,"Tissue atlas Arabidopsis - ProteomicsDB",114,32188942,"MaxQuant score",214.3000000,1.0000000,,,,0,
SFITSLITLRSNNIK,ph,S,31,true,"TOR Kinase and ABA Receptor",100,29290610,XCorr,2.6171675,0.9830000,,,,0.00028859998565167,
LQELKEK,ac,K,56,false,"Quantitative Acetylproteomics",101,29440448,,,,,,,,
MLHFKPGGVNSIIQVTDLK,ub,K,190,true,"upl3 mutant / wildtype",168,35926874,"MaxQuant score",119.8000000,1.0000000,0.8742068,0.2935800,NO,4.9495298267907E-13,1.4120000
ATDEAVCNSFTTVEAGK,so,C,370,true,"S-sulfenylation site detection using YAP1C",110,32714340,,,,,,,,
