Peptide,PTM,ModifiedAA,ModifiedPosition,PeptideUniqueToGene,ExperimentDesc,ExpID,PubmedID,ScoreType,IdentScore,LocProb,Log2FChange,PQ-val,QuantSig,PEP,MassErrorPPM
ANDSSIRHESFGHEDDEDNGDTEGR,ph,S,415,true,"TOR Kinase and ABA Receptor",100,29290610,XCorr,3.7055838,0.7647000,,,,9.9040000350215E-5,
LFSSASSSHDSPVAVR,ph,S,438,true,"Tissue atlas Arabidopsis - ProteomicsDB",114,32188942,"MaxQuant score",121.3200000,0.9261520,,,,1.3283600708291E-7,
LFSSASSSHDSPVAVR,ph,S,439,true,"Tissue atlas Arabidopsis - ProteomicsDB",114,32188942,"MaxQuant score",122.1200000,0.7832060,,,,4.9438799720747E-8,
LFSSASSSHDSPVAVR,ph,S,443,true,"Tissue atlas Arabidopsis - ProteomicsDB",114,32188942,"MaxQuant score",158.4500000,0.9999770,,,,1.0877900007622E-13,
LLNSSTYHYSPAIDDDQNQQQR,ph,S,475,true,"Lateral root-induction - NAA vs control",106,23328941,"MASCOT Score",24.0000000,,,,,,
LLNSSTYHYSPAIDDDQNQQQR,ph,S,476,true,"Lateral root-induction - NAA vs control",106,23328941,"MASCOT Score",26.0000000,,,,,,
LLNSSTYHYSPAIDDDQNQQQR,ph,T,477,true,"Tissue atlas Arabidopsis - ProteomicsDB",114,32188942,"MaxQuant score",207.6400000,0.9724640,,,,0,
MRSLVDTR,ph,S,504,true,"Tissue atlas Arabidopsis - ProteomicsDB",114,32188942,"MaxQuant score",86.2430000,0.9999980,,,,0.013987299986184,
SLMELINKR,ph,S,516,true,"Tissue atlas Arabidopsis - ProteomicsDB",114,32188942,"MaxQuant score",119.6800000,1.0000000,,,,0.00024961499730125,
